Uploaded image for project: 'Jenkins'
  1. Jenkins
  2. JENKINS-23239

Test failures running "mvn install" on source

    XMLWordPrintable

Details

    • Bug
    • Status: Resolved (View Workflow)
    • Major
    • Resolution: Duplicate
    • core
    • None

    Description

      Running:

      [lockable-resources-plugin (master)]$ mvn install
      ...
      Tests run: 2, Failures: 0, Errors: 2, Skipped: 0

      [INFO] ------------------------------------------------------------------------
      [INFO] BUILD FAILURE
      [INFO] ------------------------------------------------------------------------
      [INFO] Total time: 8.191 s
      [INFO] Finished at: 2014-05-29T14:02:45-08:00
      [INFO] Final Memory: 19M/187M
      [INFO] ------------------------------------------------------------------------
      [ERROR] Failed to execute goal org.apache.maven.plugins:maven-surefire-plugin:2.9:test (default-test) on project lockable-resources: There are test failures.
      [ERROR]
      [ERROR] Please refer to /Users/drosser/workstuff/lockable-resources-plugin/target/surefire-reports for the individual test results.
      [ERROR] -> [Help 1]
      [ERROR]
      [ERROR] To see the full stack trace of the errors, re-run Maven with the -e switch.
      [ERROR] Re-run Maven using the -X switch to enable full debug logging.
      [ERROR]
      [ERROR] For more information about the errors and possible solutions, please read the following articles:
      [ERROR] [Help 1] http://cwiki.apache.org/confluence/display/MAVEN/MojoFailureException

      From /Users/drosser/workstuff/lockable-resources-plugin/target/surefire-reports/InjectedTest.txt
      -------------------------------------------------------------------------------
      Test set: InjectedTest
      -------------------------------------------------------------------------------
      Tests run: 2, Failures: 0, Errors: 2, Skipped: 0, Time elapsed: 4.651 sec <<< FAILURE!
      org.jvnet.hudson.test.JellyTestSuiteBuilder$JellyTestSuite(org.jvnet.hudson.test.junit.FailedTest) Time elapsed: 0.007 sec <<< ERROR!
      java.lang.ArrayIndexOutOfBoundsException: -1
      at com.thoughtworks.xstream.core.util.OrderRetainingMap.entrySet(OrderRetainingMap.java:77)
      at java.util.HashMap.putMapEntries(HashMap.java:511)
      at java.util.HashMap.putAll(HashMap.java:784)
      at com.thoughtworks.xstream.core.util.OrderRetainingMap.<init>(OrderRetainingMap.java:36)
      at com.thoughtworks.xstream.converters.reflection.FieldDictionary.buildMap(FieldDictionary.java:135)
      at com.thoughtworks.xstream.converters.reflection.FieldDictionary.fieldsFor(FieldDictionary.java:76)
      at com.thoughtworks.xstream.converters.reflection.PureJavaReflectionProvider.visitSerializableFields(PureJavaReflectionProvider.java:127)
      at hudson.util.RobustReflectionConverter.doMarshal(RobustReflectionConverter.java:143)
      at hudson.util.RobustReflectionConverter.marshal(RobustReflectionConverter.java:102)
      at com.thoughtworks.xstream.core.AbstractReferenceMarshaller.convert(AbstractReferenceMarshaller.java:69)
      at com.thoughtworks.xstream.core.TreeMarshaller.convertAnother(TreeMarshaller.java:58)
      at com.thoughtworks.xstream.core.TreeMarshaller.convertAnother(TreeMarshaller.java:43)
      at com.thoughtworks.xstream.core.TreeMarshaller.start(TreeMarshaller.java:82)
      at com.thoughtworks.xstream.core.AbstractTreeMarshallingStrategy.marshal(AbstractTreeMarshallingStrategy.java:37)
      at com.thoughtworks.xstream.XStream.marshal(XStream.java:898)
      at com.thoughtworks.xstream.XStream.marshal(XStream.java:887)
      at com.thoughtworks.xstream.XStream.toXML(XStream.java:860)
      at hudson.XmlFile.write(XmlFile.java:183)
      at jenkins.model.Jenkins.save(Jenkins.java:2642)
      at jenkins.model.Jenkins.setNoUsageStatistics(Jenkins.java:979)
      at org.jvnet.hudson.test.HudsonTestCase.setUp(HudsonTestCase.java:326)
      at org.jvnet.hudson.test.JellyTestSuiteBuilder$JellyTestSuite.setUp(JellyTestSuiteBuilder.java:133)
      at org.jvnet.hudson.test.junit.GroupedTest.run(GroupedTest.java:46)
      at junit.framework.TestSuite.runTest(TestSuite.java:255)
      at junit.framework.TestSuite.run(TestSuite.java:250)
      at org.junit.internal.runners.JUnit38ClassRunner.run(JUnit38ClassRunner.java:84)
      at org.apache.maven.surefire.junit4.JUnit4TestSet.execute(JUnit4TestSet.java:53)
      at org.apache.maven.surefire.junit4.JUnit4Provider.executeTestSet(JUnit4Provider.java:123)
      at org.apache.maven.surefire.junit4.JUnit4Provider.invoke(JUnit4Provider.java:104)
      at sun.reflect.NativeMethodAccessorImpl.invoke0(Native Method)
      at sun.reflect.NativeMethodAccessorImpl.invoke(NativeMethodAccessorImpl.java:62)
      at sun.reflect.DelegatingMethodAccessorImpl.invoke(DelegatingMethodAccessorImpl.java:43)
      at java.lang.reflect.Method.invoke(Method.java:483)
      at org.apache.maven.surefire.util.ReflectionUtils.invokeMethodWithArray(ReflectionUtils.java:164)
      at org.apache.maven.surefire.booter.ProviderFactory$ProviderProxy.invoke(ProviderFactory.java:110)
      at org.apache.maven.surefire.booter.SurefireStarter.invokeProvider(SurefireStarter.java:172)
      at org.apache.maven.surefire.booter.SurefireStarter.runSuitesInProcessWhenForked(SurefireStarter.java:104)
      at org.apache.maven.surefire.booter.ForkedBooter.main(ForkedBooter.java:70)
      testCliSanity(org.jvnet.hudson.test.PluginAutomaticTestBuilder$CliSanityTest) Time elapsed: 0.011 sec <<< ERROR!
      java.lang.IllegalStateException: second instance
      at jenkins.model.Jenkins.<init>(Jenkins.java:748)
      at hudson.model.Hudson.<init>(Hudson.java:81)
      at org.jvnet.hudson.test.HudsonTestCase.newHudson(HudsonTestCase.java:481)
      at org.jvnet.hudson.test.HudsonTestCase.setUp(HudsonTestCase.java:318)
      at junit.framework.TestCase.runBare(TestCase.java:139)
      at org.jvnet.hudson.test.HudsonTestCase.runBare(HudsonTestCase.java:296)
      at junit.framework.TestResult$1.protect(TestResult.java:122)
      at junit.framework.TestResult.runProtected(TestResult.java:142)
      at junit.framework.TestResult.run(TestResult.java:125)
      at junit.framework.TestCase.run(TestCase.java:129)
      at junit.framework.TestSuite.runTest(TestSuite.java:255)
      at junit.framework.TestSuite.run(TestSuite.java:250)
      at junit.framework.TestSuite.runTest(TestSuite.java:255)
      at junit.framework.TestSuite.run(TestSuite.java:250)
      at org.junit.internal.runners.JUnit38ClassRunner.run(JUnit38ClassRunner.java:84)
      at org.apache.maven.surefire.junit4.JUnit4TestSet.execute(JUnit4TestSet.java:53)
      at org.apache.maven.surefire.junit4.JUnit4Provider.executeTestSet(JUnit4Provider.java:123)
      at org.apache.maven.surefire.junit4.JUnit4Provider.invoke(JUnit4Provider.java:104)
      at sun.reflect.NativeMethodAccessorImpl.invoke0(Native Method)
      at sun.reflect.NativeMethodAccessorImpl.invoke(NativeMethodAccessorImpl.java:62)
      at sun.reflect.DelegatingMethodAccessorImpl.invoke(DelegatingMethodAccessorImpl.java:43)
      at java.lang.reflect.Method.invoke(Method.java:483)
      at org.apache.maven.surefire.util.ReflectionUtils.invokeMethodWithArray(ReflectionUtils.java:164)
      at org.apache.maven.surefire.booter.ProviderFactory$ProviderProxy.invoke(ProviderFactory.java:110)
      at org.apache.maven.surefire.booter.SurefireStarter.invokeProvider(SurefireStarter.java:172)
      at org.apache.maven.surefire.booter.SurefireStarter.runSuitesInProcessWhenForked(SurefireStarter.java:104)
      at org.apache.maven.surefire.booter.ForkedBooter.main(ForkedBooter.java:70)

      Attachments

        Issue Links

          Activity

            drosser9 Douglas Rosser created issue -
            drulli Ulli Hafner made changes -
            Field Original Value New Value
            Component/s core [ 15593 ]
            Component/s lockable-resources-plugin [ 18222 ]
            jglick Jesse Glick made changes -
            Link This issue duplicates JENKINS-18537 [ JENKINS-18537 ]
            jglick Jesse Glick made changes -
            Resolution Duplicate [ 3 ]
            Status Open [ 1 ] Resolved [ 5 ]
            rtyler R. Tyler Croy made changes -
            Workflow JNJira [ 155800 ] JNJira + In-Review [ 195250 ]

            People

              Unassigned Unassigned
              drosser9 Douglas Rosser
              Votes:
              1 Vote for this issue
              Watchers:
              6 Start watching this issue

              Dates

                Created:
                Updated:
                Resolved: