Uploaded image for project: 'Jenkins'
  1. Jenkins
  2. JENKINS-59713

Glassfish 4 Failed deployment: org.codehaus.cargo.util.CargoException: Deployment has failed: null

    XMLWordPrintable

    Details

    • Type: Bug
    • Status: Open (View Workflow)
    • Priority: Minor
    • Resolution: Unresolved
    • Component/s: deploy-plugin
    • Labels:
      None
    • Environment:
      Jenkins ver. 2.190.1, Deploy to container plugin version 1.15
    • Similar Issues:

      Description

      Failed deployment in glassfish 4 usingĀ Deploy to container plugin:

      [DeployPublisher][INFO] Attempting to deploy 1 war file(s)
      [DeployPublisher][INFO] Deploying D:\webApp-3.0-SNAPSHOT-6.war to container GlassFish 4.x Remote with context webApp
      ERROR: Build step failed with exception
      org.codehaus.cargo.util.CargoException: Deployment has failed: null
      at org.codehaus.cargo.container.spi.deployer.AbstractJsr88Deployer.waitForProgressObject(AbstractJsr88Deployer.java:284)
      at org.codehaus.cargo.container.spi.deployer.AbstractJsr88Deployer.deploy(AbstractJsr88Deployer.java:133)
      at org.codehaus.cargo.container.spi.deployer.AbstractJsr88Deployer.redeploy(AbstractJsr88Deployer.java:210)
      at hudson.plugins.deploy.CargoContainerAdapter.deploy(CargoContainerAdapter.java:81)
      at hudson.plugins.deploy.CargoContainerAdapter$DeployCallable.invoke(CargoContainerAdapter.java:167)
      at hudson.plugins.deploy.CargoContainerAdapter$DeployCallable.invoke(CargoContainerAdapter.java:136)
      at hudson.FilePath.act(FilePath.java:1078)
      at hudson.FilePath.act(FilePath.java:1061)
      at hudson.plugins.deploy.CargoContainerAdapter.redeployFile(CargoContainerAdapter.java:133)
      at hudson.plugins.deploy.PasswordProtectedAdapterCargo.redeployFile(PasswordProtectedAdapterCargo.java:95)
      at hudson.plugins.deploy.DeployPublisher.perform(DeployPublisher.java:113)
      at hudson.tasks.BuildStepCompatibilityLayer.perform(BuildStepCompatibilityLayer.java:79)
      at hudson.tasks.BuildStepMonitor$3.perform(BuildStepMonitor.java:45)
      at hudson.model.AbstractBuild$AbstractBuildExecution.perform(AbstractBuild.java:741)
      at hudson.model.AbstractBuild$AbstractBuildExecution.performAllBuildSteps(AbstractBuild.java:690)
      at hudson.maven.MavenModuleSetBuild$MavenModuleSetBuildExecution.post2(MavenModuleSetBuild.java:1074)
      at hudson.model.AbstractBuild$AbstractBuildExecution.post(AbstractBuild.java:635)
      at hudson.model.Run.execute(Run.java:1840)
      at hudson.maven.MavenModuleSetBuild.run(MavenModuleSetBuild.java:543)
      at hudson.model.ResourceController.execute(ResourceController.java:97)
      at hudson.model.Executor.run(Executor.java:429)
      Build step 'Deploy war/ear to a container' marked build as failure
      SSH: Current build result is [FAILURE], not going to run.
      Finished: FAILURE

        Attachments

          Activity

          thestarkcoder Francis Alcala created issue -
          thestarkcoder Francis Alcala made changes -
          Field Original Value New Value
          Description [DeployPublisher][INFO] Attempting to deploy 1 war file(s)
          [DeployPublisher][INFO] Deploying D:\webApp-3.0-SNAPSHOT-6.war to container GlassFish 4.x Remote with context bwlweb
          ERROR: Build step failed with exception
          org.codehaus.cargo.util.CargoException: Deployment has failed: null
           at org.codehaus.cargo.container.spi.deployer.AbstractJsr88Deployer.waitForProgressObject(AbstractJsr88Deployer.java:284)
           at org.codehaus.cargo.container.spi.deployer.AbstractJsr88Deployer.deploy(AbstractJsr88Deployer.java:133)
           at org.codehaus.cargo.container.spi.deployer.AbstractJsr88Deployer.redeploy(AbstractJsr88Deployer.java:210)
           at hudson.plugins.deploy.CargoContainerAdapter.deploy(CargoContainerAdapter.java:81)
           at hudson.plugins.deploy.CargoContainerAdapter$DeployCallable.invoke(CargoContainerAdapter.java:167)
           at hudson.plugins.deploy.CargoContainerAdapter$DeployCallable.invoke(CargoContainerAdapter.java:136)
           at hudson.FilePath.act(FilePath.java:1078)
           at hudson.FilePath.act(FilePath.java:1061)
           at hudson.plugins.deploy.CargoContainerAdapter.redeployFile(CargoContainerAdapter.java:133)
           at hudson.plugins.deploy.PasswordProtectedAdapterCargo.redeployFile(PasswordProtectedAdapterCargo.java:95)
           at hudson.plugins.deploy.DeployPublisher.perform(DeployPublisher.java:113)
           at hudson.tasks.BuildStepCompatibilityLayer.perform(BuildStepCompatibilityLayer.java:79)
           at hudson.tasks.BuildStepMonitor$3.perform(BuildStepMonitor.java:45)
           at hudson.model.AbstractBuild$AbstractBuildExecution.perform(AbstractBuild.java:741)
           at hudson.model.AbstractBuild$AbstractBuildExecution.performAllBuildSteps(AbstractBuild.java:690)
           at hudson.maven.MavenModuleSetBuild$MavenModuleSetBuildExecution.post2(MavenModuleSetBuild.java:1074)
           at hudson.model.AbstractBuild$AbstractBuildExecution.post(AbstractBuild.java:635)
           at hudson.model.Run.execute(Run.java:1840)
           at hudson.maven.MavenModuleSetBuild.run(MavenModuleSetBuild.java:543)
           at hudson.model.ResourceController.execute(ResourceController.java:97)
           at hudson.model.Executor.run(Executor.java:429)
          Build step 'Deploy war/ear to a container' marked build as failure
          SSH: Current build result is [FAILURE], not going to run.
          Finished: FAILURE
          [DeployPublisher][INFO] Attempting to deploy 1 war file(s)
           [DeployPublisher][INFO] Deploying D:\webApp-3.0-SNAPSHOT-6.war to container GlassFish 4.x Remote with context bwlweb
           ERROR: Build step failed with exception
           org.codehaus.cargo.util.CargoException: Deployment has failed: null
           at org.codehaus.cargo.container.spi.deployer.AbstractJsr88Deployer.waitForProgressObject(AbstractJsr88Deployer.java:284)
           at org.codehaus.cargo.container.spi.deployer.AbstractJsr88Deployer.deploy(AbstractJsr88Deployer.java:133)
           at org.codehaus.cargo.container.spi.deployer.AbstractJsr88Deployer.redeploy(AbstractJsr88Deployer.java:210)
           at hudson.plugins.deploy.CargoContainerAdapter.deploy(CargoContainerAdapter.java:81)
           at hudson.plugins.deploy.CargoContainerAdapter$DeployCallable.invoke(CargoContainerAdapter.java:167)
           at hudson.plugins.deploy.CargoContainerAdapter$DeployCallable.invoke(CargoContainerAdapter.java:136)
           at hudson.FilePath.act(FilePath.java:1078)
           at hudson.FilePath.act(FilePath.java:1061)
           at hudson.plugins.deploy.CargoContainerAdapter.redeployFile(CargoContainerAdapter.java:133)
           at hudson.plugins.deploy.PasswordProtectedAdapterCargo.redeployFile(PasswordProtectedAdapterCargo.java:95)
           at hudson.plugins.deploy.DeployPublisher.perform(DeployPublisher.java:113)
           at hudson.tasks.BuildStepCompatibilityLayer.perform(BuildStepCompatibilityLayer.java:79)
           at hudson.tasks.BuildStepMonitor$3.perform(BuildStepMonitor.java:45)
           at hudson.model.AbstractBuild$AbstractBuildExecution.perform(AbstractBuild.java:741)
           at hudson.model.AbstractBuild$AbstractBuildExecution.performAllBuildSteps(AbstractBuild.java:690)
           at hudson.maven.MavenModuleSetBuild$MavenModuleSetBuildExecution.post2(MavenModuleSetBuild.java:1074)
           at hudson.model.AbstractBuild$AbstractBuildExecution.post(AbstractBuild.java:635)
           at hudson.model.Run.execute(Run.java:1840)
           at hudson.maven.MavenModuleSetBuild.run(MavenModuleSetBuild.java:543)
           at hudson.model.ResourceController.execute(ResourceController.java:97)
           at hudson.model.Executor.run(Executor.java:429)
           Build step 'Deploy war/ear to a container' marked build as failure
           SSH: Current build result is [FAILURE], not going to run.
           Finished: FAILURE
          Summary Failed deployment: org.codehaus.cargo.util.CargoException: Deployment has failed: null Glassfish 4 Failed deployment: org.codehaus.cargo.util.CargoException: Deployment has failed: null
          thestarkcoder Francis Alcala made changes -
          Description [DeployPublisher][INFO] Attempting to deploy 1 war file(s)
           [DeployPublisher][INFO] Deploying D:\webApp-3.0-SNAPSHOT-6.war to container GlassFish 4.x Remote with context bwlweb
           ERROR: Build step failed with exception
           org.codehaus.cargo.util.CargoException: Deployment has failed: null
           at org.codehaus.cargo.container.spi.deployer.AbstractJsr88Deployer.waitForProgressObject(AbstractJsr88Deployer.java:284)
           at org.codehaus.cargo.container.spi.deployer.AbstractJsr88Deployer.deploy(AbstractJsr88Deployer.java:133)
           at org.codehaus.cargo.container.spi.deployer.AbstractJsr88Deployer.redeploy(AbstractJsr88Deployer.java:210)
           at hudson.plugins.deploy.CargoContainerAdapter.deploy(CargoContainerAdapter.java:81)
           at hudson.plugins.deploy.CargoContainerAdapter$DeployCallable.invoke(CargoContainerAdapter.java:167)
           at hudson.plugins.deploy.CargoContainerAdapter$DeployCallable.invoke(CargoContainerAdapter.java:136)
           at hudson.FilePath.act(FilePath.java:1078)
           at hudson.FilePath.act(FilePath.java:1061)
           at hudson.plugins.deploy.CargoContainerAdapter.redeployFile(CargoContainerAdapter.java:133)
           at hudson.plugins.deploy.PasswordProtectedAdapterCargo.redeployFile(PasswordProtectedAdapterCargo.java:95)
           at hudson.plugins.deploy.DeployPublisher.perform(DeployPublisher.java:113)
           at hudson.tasks.BuildStepCompatibilityLayer.perform(BuildStepCompatibilityLayer.java:79)
           at hudson.tasks.BuildStepMonitor$3.perform(BuildStepMonitor.java:45)
           at hudson.model.AbstractBuild$AbstractBuildExecution.perform(AbstractBuild.java:741)
           at hudson.model.AbstractBuild$AbstractBuildExecution.performAllBuildSteps(AbstractBuild.java:690)
           at hudson.maven.MavenModuleSetBuild$MavenModuleSetBuildExecution.post2(MavenModuleSetBuild.java:1074)
           at hudson.model.AbstractBuild$AbstractBuildExecution.post(AbstractBuild.java:635)
           at hudson.model.Run.execute(Run.java:1840)
           at hudson.maven.MavenModuleSetBuild.run(MavenModuleSetBuild.java:543)
           at hudson.model.ResourceController.execute(ResourceController.java:97)
           at hudson.model.Executor.run(Executor.java:429)
           Build step 'Deploy war/ear to a container' marked build as failure
           SSH: Current build result is [FAILURE], not going to run.
           Finished: FAILURE
          Failed deployment in glassfish 4 using *Deploy to container* plugin:

          [DeployPublisher][INFO] Attempting to deploy 1 war file(s)
           [DeployPublisher][INFO] Deploying D:\webApp-3.0-SNAPSHOT-6.war to container GlassFish 4.x Remote with context bwlweb
           ERROR: Build step failed with exception
           org.codehaus.cargo.util.CargoException: Deployment has failed: null
           at org.codehaus.cargo.container.spi.deployer.AbstractJsr88Deployer.waitForProgressObject(AbstractJsr88Deployer.java:284)
           at org.codehaus.cargo.container.spi.deployer.AbstractJsr88Deployer.deploy(AbstractJsr88Deployer.java:133)
           at org.codehaus.cargo.container.spi.deployer.AbstractJsr88Deployer.redeploy(AbstractJsr88Deployer.java:210)
           at hudson.plugins.deploy.CargoContainerAdapter.deploy(CargoContainerAdapter.java:81)
           at hudson.plugins.deploy.CargoContainerAdapter$DeployCallable.invoke(CargoContainerAdapter.java:167)
           at hudson.plugins.deploy.CargoContainerAdapter$DeployCallable.invoke(CargoContainerAdapter.java:136)
           at hudson.FilePath.act(FilePath.java:1078)
           at hudson.FilePath.act(FilePath.java:1061)
           at hudson.plugins.deploy.CargoContainerAdapter.redeployFile(CargoContainerAdapter.java:133)
           at hudson.plugins.deploy.PasswordProtectedAdapterCargo.redeployFile(PasswordProtectedAdapterCargo.java:95)
           at hudson.plugins.deploy.DeployPublisher.perform(DeployPublisher.java:113)
           at hudson.tasks.BuildStepCompatibilityLayer.perform(BuildStepCompatibilityLayer.java:79)
           at hudson.tasks.BuildStepMonitor$3.perform(BuildStepMonitor.java:45)
           at hudson.model.AbstractBuild$AbstractBuildExecution.perform(AbstractBuild.java:741)
           at hudson.model.AbstractBuild$AbstractBuildExecution.performAllBuildSteps(AbstractBuild.java:690)
           at hudson.maven.MavenModuleSetBuild$MavenModuleSetBuildExecution.post2(MavenModuleSetBuild.java:1074)
           at hudson.model.AbstractBuild$AbstractBuildExecution.post(AbstractBuild.java:635)
           at hudson.model.Run.execute(Run.java:1840)
           at hudson.maven.MavenModuleSetBuild.run(MavenModuleSetBuild.java:543)
           at hudson.model.ResourceController.execute(ResourceController.java:97)
           at hudson.model.Executor.run(Executor.java:429)
           Build step 'Deploy war/ear to a container' marked build as failure
           SSH: Current build result is [FAILURE], not going to run.
           Finished: FAILURE
          Environment Jenkins ver. 2.190.1, Deploy to container plugin version 1.15
          thestarkcoder Francis Alcala made changes -
          Description Failed deployment in glassfish 4 using *Deploy to container* plugin:

          [DeployPublisher][INFO] Attempting to deploy 1 war file(s)
           [DeployPublisher][INFO] Deploying D:\webApp-3.0-SNAPSHOT-6.war to container GlassFish 4.x Remote with context bwlweb
           ERROR: Build step failed with exception
           org.codehaus.cargo.util.CargoException: Deployment has failed: null
           at org.codehaus.cargo.container.spi.deployer.AbstractJsr88Deployer.waitForProgressObject(AbstractJsr88Deployer.java:284)
           at org.codehaus.cargo.container.spi.deployer.AbstractJsr88Deployer.deploy(AbstractJsr88Deployer.java:133)
           at org.codehaus.cargo.container.spi.deployer.AbstractJsr88Deployer.redeploy(AbstractJsr88Deployer.java:210)
           at hudson.plugins.deploy.CargoContainerAdapter.deploy(CargoContainerAdapter.java:81)
           at hudson.plugins.deploy.CargoContainerAdapter$DeployCallable.invoke(CargoContainerAdapter.java:167)
           at hudson.plugins.deploy.CargoContainerAdapter$DeployCallable.invoke(CargoContainerAdapter.java:136)
           at hudson.FilePath.act(FilePath.java:1078)
           at hudson.FilePath.act(FilePath.java:1061)
           at hudson.plugins.deploy.CargoContainerAdapter.redeployFile(CargoContainerAdapter.java:133)
           at hudson.plugins.deploy.PasswordProtectedAdapterCargo.redeployFile(PasswordProtectedAdapterCargo.java:95)
           at hudson.plugins.deploy.DeployPublisher.perform(DeployPublisher.java:113)
           at hudson.tasks.BuildStepCompatibilityLayer.perform(BuildStepCompatibilityLayer.java:79)
           at hudson.tasks.BuildStepMonitor$3.perform(BuildStepMonitor.java:45)
           at hudson.model.AbstractBuild$AbstractBuildExecution.perform(AbstractBuild.java:741)
           at hudson.model.AbstractBuild$AbstractBuildExecution.performAllBuildSteps(AbstractBuild.java:690)
           at hudson.maven.MavenModuleSetBuild$MavenModuleSetBuildExecution.post2(MavenModuleSetBuild.java:1074)
           at hudson.model.AbstractBuild$AbstractBuildExecution.post(AbstractBuild.java:635)
           at hudson.model.Run.execute(Run.java:1840)
           at hudson.maven.MavenModuleSetBuild.run(MavenModuleSetBuild.java:543)
           at hudson.model.ResourceController.execute(ResourceController.java:97)
           at hudson.model.Executor.run(Executor.java:429)
           Build step 'Deploy war/ear to a container' marked build as failure
           SSH: Current build result is [FAILURE], not going to run.
           Finished: FAILURE
          Failed deployment in glassfish 4 using *Deploy to container* plugin:

          [DeployPublisher][INFO] Attempting to deploy 1 war file(s)
           [DeployPublisher][INFO] Deploying D:\webApp-3.0-SNAPSHOT-6.war to container GlassFish 4.x Remote with context webApp
           ERROR: Build step failed with exception
           org.codehaus.cargo.util.CargoException: Deployment has failed: null
           at org.codehaus.cargo.container.spi.deployer.AbstractJsr88Deployer.waitForProgressObject(AbstractJsr88Deployer.java:284)
           at org.codehaus.cargo.container.spi.deployer.AbstractJsr88Deployer.deploy(AbstractJsr88Deployer.java:133)
           at org.codehaus.cargo.container.spi.deployer.AbstractJsr88Deployer.redeploy(AbstractJsr88Deployer.java:210)
           at hudson.plugins.deploy.CargoContainerAdapter.deploy(CargoContainerAdapter.java:81)
           at hudson.plugins.deploy.CargoContainerAdapter$DeployCallable.invoke(CargoContainerAdapter.java:167)
           at hudson.plugins.deploy.CargoContainerAdapter$DeployCallable.invoke(CargoContainerAdapter.java:136)
           at hudson.FilePath.act(FilePath.java:1078)
           at hudson.FilePath.act(FilePath.java:1061)
           at hudson.plugins.deploy.CargoContainerAdapter.redeployFile(CargoContainerAdapter.java:133)
           at hudson.plugins.deploy.PasswordProtectedAdapterCargo.redeployFile(PasswordProtectedAdapterCargo.java:95)
           at hudson.plugins.deploy.DeployPublisher.perform(DeployPublisher.java:113)
           at hudson.tasks.BuildStepCompatibilityLayer.perform(BuildStepCompatibilityLayer.java:79)
           at hudson.tasks.BuildStepMonitor$3.perform(BuildStepMonitor.java:45)
           at hudson.model.AbstractBuild$AbstractBuildExecution.perform(AbstractBuild.java:741)
           at hudson.model.AbstractBuild$AbstractBuildExecution.performAllBuildSteps(AbstractBuild.java:690)
           at hudson.maven.MavenModuleSetBuild$MavenModuleSetBuildExecution.post2(MavenModuleSetBuild.java:1074)
           at hudson.model.AbstractBuild$AbstractBuildExecution.post(AbstractBuild.java:635)
           at hudson.model.Run.execute(Run.java:1840)
           at hudson.maven.MavenModuleSetBuild.run(MavenModuleSetBuild.java:543)
           at hudson.model.ResourceController.execute(ResourceController.java:97)
           at hudson.model.Executor.run(Executor.java:429)
           Build step 'Deploy war/ear to a container' marked build as failure
           SSH: Current build result is [FAILURE], not going to run.
           Finished: FAILURE

            People

            Assignee:
            Unassigned Unassigned
            Reporter:
            thestarkcoder Francis Alcala
            Votes:
            0 Vote for this issue
            Watchers:
            2 Start watching this issue

              Dates

              Created:
              Updated: