Uploaded image for project: 'Jenkins'
  1. Jenkins
  2. JENKINS-61276

Unittest fails for accessing http://repo1.maven.org/

      [INFO] ------------------------------------------------------------------------
      [INFO] Building moduleA
      [INFO]    task-segment: [clean, package]
      [INFO] ------------------------------------------------------------------------
      Downloading: http://repo1.maven.org/maven2/org/apache/maven/plugins/maven-clean-plugin/2.2/maven-clean-plugin-2.2.pom
      [WARNING] Unable to get resource 'org.apache.maven.plugins:maven-clean-plugin:pom:2.2' from repository central (http://repo1.maven.org/maven2): Error transferring file: Server returned HTTP response code: 501 for URL: http://repo1.maven.org/maven2/org/apache/maven/plugins/maven-clean-plugin/2.2/maven-clean-plugin-2.2.pom
      Downloading: http://repo1.maven.org/maven2/org/apache/maven/plugins/maven-clean-plugin/2.2/maven-clean-plugin-2.2.pom
      [WARNING] Unable to get resource 'org.apache.maven.plugins:maven-clean-plugin:pom:2.2' from repository central (http://repo1.maven.org/maven2): Error transferring file: Server returned HTTP response code: 501 for URL: http://repo1.maven.org/maven2/org/apache/maven/plugins/maven-clean-plugin/2.2/maven-clean-plugin-2.2.pom
      [INFO] ------------------------------------------------------------------------
      [ERROR] BUILD ERROR
      [INFO] ------------------------------------------------------------------------
      [INFO] Error building POM (may not be this project's POM).
      

      failed tests:
      https://ci.jenkins.io/blue/organizations/jenkins/Plugins%2Fcopyartifact-plugin/detail/PR-116/1/tests/

      • linux-8 / Build (linux-8) / testMavenJobWithArchivePostBuildStep – hudson.plugins.copyartifact.CopyArtifactTest9s
      • linux-8 / Build (linux-8) / testEnvDataInMavenProject – hudson.plugins.copyartifact.CopyArtifactTest8s
      • linux-8 / Build (linux-8) / testMavenAll – hudson.plugins.copyartifact.CopyArtifactTest5s
      • linux-8 / Build (linux-8) / testMavenJob – hudson.plugins.copyartifact.CopyArtifactTest5s
      • linux-8 / Build (linux-8) / testPermissionWhenParameterizedForMavenModule –
      • hudson.plugins.copyartifact.CopyArtifactTest5s
        linux-8 / Build (linux-8) / testMavenModule –
      • hudson.plugins.copyartifact.TriggeredBuildSelectorTest

          [JENKINS-61276] Unittest fails for accessing http://repo1.maven.org/

          ikedam created issue -
          ikedam made changes -
          Status Original: Open [ 1 ] New: In Progress [ 3 ]
          ikedam made changes -
          Description Original: {code}
          [INFO] ------------------------------------------------------------------------
          [INFO] Building moduleA
          [INFO] task-segment: [clean, package]
          [INFO] ------------------------------------------------------------------------
          Downloading: http://repo1.maven.org/maven2/org/apache/maven/plugins/maven-clean-plugin/2.2/maven-clean-plugin-2.2.pom
          [WARNING] Unable to get resource 'org.apache.maven.plugins:maven-clean-plugin:pom:2.2' from repository central (http://repo1.maven.org/maven2): Error transferring file: Server returned HTTP response code: 501 for URL: http://repo1.maven.org/maven2/org/apache/maven/plugins/maven-clean-plugin/2.2/maven-clean-plugin-2.2.pom
          Downloading: http://repo1.maven.org/maven2/org/apache/maven/plugins/maven-clean-plugin/2.2/maven-clean-plugin-2.2.pom
          [WARNING] Unable to get resource 'org.apache.maven.plugins:maven-clean-plugin:pom:2.2' from repository central (http://repo1.maven.org/maven2): Error transferring file: Server returned HTTP response code: 501 for URL: http://repo1.maven.org/maven2/org/apache/maven/plugins/maven-clean-plugin/2.2/maven-clean-plugin-2.2.pom
          [INFO] ------------------------------------------------------------------------
          [ERROR] BUILD ERROR
          [INFO] ------------------------------------------------------------------------
          [INFO] Error building POM (may not be this project's POM).
          {code}


          failed tests:
          * linux-8 / Build (linux-8) / testMavenJobWithArchivePostBuildStep – hudson.plugins.copyartifact.CopyArtifactTest9s
          * linux-8 / Build (linux-8) / testEnvDataInMavenProject – hudson.plugins.copyartifact.CopyArtifactTest8s
          * linux-8 / Build (linux-8) / testMavenAll – hudson.plugins.copyartifact.CopyArtifactTest5s
          * linux-8 / Build (linux-8) / testMavenJob – hudson.plugins.copyartifact.CopyArtifactTest5s
          * linux-8 / Build (linux-8) / testPermissionWhenParameterizedForMavenModule –
          * hudson.plugins.copyartifact.CopyArtifactTest5s
          linux-8 / Build (linux-8) / testMavenModule –
          * hudson.plugins.copyartifact.TriggeredBuildSelectorTest
          New: {code:java}
          [INFO] ------------------------------------------------------------------------
          [INFO] Building moduleA
          [INFO] task-segment: [clean, package]
          [INFO] ------------------------------------------------------------------------
          Downloading: http://repo1.maven.org/maven2/org/apache/maven/plugins/maven-clean-plugin/2.2/maven-clean-plugin-2.2.pom
          [WARNING] Unable to get resource 'org.apache.maven.plugins:maven-clean-plugin:pom:2.2' from repository central (http://repo1.maven.org/maven2): Error transferring file: Server returned HTTP response code: 501 for URL: http://repo1.maven.org/maven2/org/apache/maven/plugins/maven-clean-plugin/2.2/maven-clean-plugin-2.2.pom
          Downloading: http://repo1.maven.org/maven2/org/apache/maven/plugins/maven-clean-plugin/2.2/maven-clean-plugin-2.2.pom
          [WARNING] Unable to get resource 'org.apache.maven.plugins:maven-clean-plugin:pom:2.2' from repository central (http://repo1.maven.org/maven2): Error transferring file: Server returned HTTP response code: 501 for URL: http://repo1.maven.org/maven2/org/apache/maven/plugins/maven-clean-plugin/2.2/maven-clean-plugin-2.2.pom
          [INFO] ------------------------------------------------------------------------
          [ERROR] BUILD ERROR
          [INFO] ------------------------------------------------------------------------
          [INFO] Error building POM (may not be this project's POM).
          {code}

          failed tests:
          https://ci.jenkins.io/blue/organizations/jenkins/Plugins%2Fcopyartifact-plugin/detail/PR-116/1/tests/
           * linux-8 / Build (linux-8) / testMavenJobWithArchivePostBuildStep – hudson.plugins.copyartifact.CopyArtifactTest9s
           * linux-8 / Build (linux-8) / testEnvDataInMavenProject – hudson.plugins.copyartifact.CopyArtifactTest8s
           * linux-8 / Build (linux-8) / testMavenAll – hudson.plugins.copyartifact.CopyArtifactTest5s
           * linux-8 / Build (linux-8) / testMavenJob – hudson.plugins.copyartifact.CopyArtifactTest5s
           * linux-8 / Build (linux-8) / testPermissionWhenParameterizedForMavenModule –
           * hudson.plugins.copyartifact.CopyArtifactTest5s
           linux-8 / Build (linux-8) / testMavenModule –
           * hudson.plugins.copyartifact.TriggeredBuildSelectorTest
          ikedam made changes -
          Status Original: In Progress [ 3 ] New: In Review [ 10005 ]

          ikedam added a comment -

          ikedam added a comment - https://github.com/jenkinsci/copyartifact-plugin/pull/117
          ikedam made changes -
          Resolution New: Fixed [ 1 ]
          Status Original: In Review [ 10005 ] New: Resolved [ 5 ]
          ikedam made changes -
          Status Original: Resolved [ 5 ] New: Closed [ 6 ]
          ikedam made changes -
          Link New: This issue relates to JENKINS-63273 [ JENKINS-63273 ]

            ikedam ikedam
            ikedam ikedam
            Votes:
            0 Vote for this issue
            Watchers:
            1 Start watching this issue

              Created:
              Updated:
              Resolved: