Started by an SCM change
Building on master in workspace /var/lib/jenkins/jobs/TRCWriter.trunk/workspace
Cleaning up /var/lib/jenkins/jobs/TRCWriter.trunk/workspace/TRCWriter
Deleting /var/lib/jenkins/jobs/TRCWriter.trunk/workspace/TRCWriter/bin
Deleting /var/lib/jenkins/jobs/TRCWriter.trunk/workspace/TRCWriter/bin-instrumented
Deleting /var/lib/jenkins/jobs/TRCWriter.trunk/workspace/TRCWriter/cobertura.ser
Deleting /var/lib/jenkins/jobs/TRCWriter.trunk/workspace/TRCWriter/dist
Deleting /var/lib/jenkins/jobs/TRCWriter.trunk/workspace/TRCWriter/dist-instrumented
Deleting /var/lib/jenkins/jobs/TRCWriter.trunk/workspace/TRCWriter/jar
Deleting /var/lib/jenkins/jobs/TRCWriter.trunk/workspace/TRCWriter/lib
Updating https://ttbsvcs101.dev.ttw/svn/webfleet/trunk/TRCWriter at revision '2014-02-05T08:58:02.421 +0100'
At revision 54800
Cleaning up /var/lib/jenkins/jobs/TRCWriter.trunk/workspace/Ivy-Migration/wfComponents
Deleting /var/lib/jenkins/jobs/TRCWriter.trunk/workspace/Ivy-Migration/wfComponents/jms/.checked-for-changes
Deleting /var/lib/jenkins/jobs/TRCWriter.trunk/workspace/Ivy-Migration/wfComponents/jms/bin
Deleting /var/lib/jenkins/jobs/TRCWriter.trunk/workspace/Ivy-Migration/wfComponents/jms/jar
Deleting /var/lib/jenkins/jobs/TRCWriter.trunk/workspace/Ivy-Migration/wfComponents/jms/lib
Deleting /var/lib/jenkins/jobs/TRCWriter.trunk/workspace/Ivy-Migration/wfComponents/jms/test-bin
Deleting /var/lib/jenkins/jobs/TRCWriter.trunk/workspace/Ivy-Migration/wfComponents/base/.checked-for-changes
Deleting /var/lib/jenkins/jobs/TRCWriter.trunk/workspace/Ivy-Migration/wfComponents/base/bin
Deleting /var/lib/jenkins/jobs/TRCWriter.trunk/workspace/Ivy-Migration/wfComponents/base/jar
Deleting /var/lib/jenkins/jobs/TRCWriter.trunk/workspace/Ivy-Migration/wfComponents/base/lib
Deleting /var/lib/jenkins/jobs/TRCWriter.trunk/workspace/Ivy-Migration/wfComponents/base/test-bin
Deleting /var/lib/jenkins/jobs/TRCWriter.trunk/workspace/Ivy-Migration/wfComponents/resourcestore/.checked-for-changes
Deleting /var/lib/jenkins/jobs/TRCWriter.trunk/workspace/Ivy-Migration/wfComponents/resourcestore/bin
Deleting /var/lib/jenkins/jobs/TRCWriter.trunk/workspace/Ivy-Migration/wfComponents/resourcestore/jar
Deleting /var/lib/jenkins/jobs/TRCWriter.trunk/workspace/Ivy-Migration/wfComponents/resourcestore/lib
Deleting /var/lib/jenkins/jobs/TRCWriter.trunk/workspace/Ivy-Migration/wfComponents/resourcestore/test-bin
Deleting /var/lib/jenkins/jobs/TRCWriter.trunk/workspace/Ivy-Migration/wfComponents/binaryprotocol/.checked-for-changes
Deleting /var/lib/jenkins/jobs/TRCWriter.trunk/workspace/Ivy-Migration/wfComponents/binaryprotocol/bin
Deleting /var/lib/jenkins/jobs/TRCWriter.trunk/workspace/Ivy-Migration/wfComponents/binaryprotocol/jar
Deleting /var/lib/jenkins/jobs/TRCWriter.trunk/workspace/Ivy-Migration/wfComponents/binaryprotocol/lib
Deleting /var/lib/jenkins/jobs/TRCWriter.trunk/workspace/Ivy-Migration/wfComponents/binaryprotocol/test-bin
Updating https://ttbsvcs101.dev.ttw/svn/webfleet/trunk/Ivy-Migration/wfComponents at revision '2014-02-05T08:58:02.421 +0100'
Fetching 'https://ttbsvcs101.dev.ttw/svn/webfleet/trunk/WF.Components/WF.components/pushapi/src' at -1 into '/var/lib/jenkins/jobs/TRCWriter.trunk/workspace/Ivy-Migration/wfComponents/pushapi/src'
At revision 54800
Fetching 'https://ttbsvcs101.dev.ttw/svn/webfleet/trunk/WF.Components/WF.components/cacheinvalidation/src' at -1 into '/var/lib/jenkins/jobs/TRCWriter.trunk/workspace/Ivy-Migration/wfComponents/cacheinvalidation/src'
At revision 54800
Fetching 'https://ttbsvcs101.dev.ttw/svn/webfleet/trunk/WF.Components/WF.components/cacheinvalidation/test' at -1 into '/var/lib/jenkins/jobs/TRCWriter.trunk/workspace/Ivy-Migration/wfComponents/cacheinvalidation/test-src'
At revision 54800
Fetching 'https://ttbsvcs101.dev.ttw/svn/webfleet/trunk/WF.Components/WF.components/cache/run-test-client.bat' at -1 into '/var/lib/jenkins/jobs/TRCWriter.trunk/workspace/Ivy-Migration/wfComponents/cache/run-test-client.bat'
At revision 54800
Fetching 'https://ttbsvcs101.dev.ttw/svn/webfleet/trunk/WF.Components/WF.components/cache/src' at -1 into '/var/lib/jenkins/jobs/TRCWriter.trunk/workspace/Ivy-Migration/wfComponents/cache/src'
At revision 54800
Fetching 'https://ttbsvcs101.dev.ttw/svn/webfleet/trunk/WF.Components/WF.components/cache/test-properties' at -1 into '/var/lib/jenkins/jobs/TRCWriter.trunk/workspace/Ivy-Migration/wfComponents/cache/test-properties'
At revision 54800
Fetching 'https://ttbsvcs101.dev.ttw/svn/webfleet/trunk/WF.Components/WF.components/cache/test-src' at -1 into '/var/lib/jenkins/jobs/TRCWriter.trunk/workspace/Ivy-Migration/wfComponents/cache/test-src'
At revision 54800
Fetching 'https://ttbsvcs101.dev.ttw/svn/webfleet/trunk/WF.Components/WF.components/settings/src' at -1 into '/var/lib/jenkins/jobs/TRCWriter.trunk/workspace/Ivy-Migration/wfComponents/settings/src'
At revision 54800
Fetching 'https://ttbsvcs101.dev.ttw/svn/webfleet/trunk/WF.Components/WF.components/asynccommands/src' at -1 into '/var/lib/jenkins/jobs/TRCWriter.trunk/workspace/Ivy-Migration/wfComponents/asynccommands/src'
At revision 54800
Fetching 'https://ttbsvcs101.dev.ttw/svn/webfleet/trunk/WF.Components/WF.components/asynccommands/test-src' at -1 into '/var/lib/jenkins/jobs/TRCWriter.trunk/workspace/Ivy-Migration/wfComponents/asynccommands/test-src'
At revision 54800
Fetching 'https://ttbsvcs101.dev.ttw/svn/webfleet/trunk/WF.Components/WF.components/datasource/src' at -1 into '/var/lib/jenkins/jobs/TRCWriter.trunk/workspace/Ivy-Migration/wfComponents/datasource/src'
At revision 54800
Fetching 'https://ttbsvcs101.dev.ttw/svn/webfleet/trunk/WF.Components/WF.components/quotacontrol/src' at -1 into '/var/lib/jenkins/jobs/TRCWriter.trunk/workspace/Ivy-Migration/wfComponents/quotacontrol/src'
At revision 54800
Fetching 'https://ttbsvcs101.dev.ttw/svn/webfleet/trunk/WF.Components/WF.components/profiling/build' at -1 into '/var/lib/jenkins/jobs/TRCWriter.trunk/workspace/Ivy-Migration/wfComponents/profiling/build'
At revision 54800
Fetching 'https://ttbsvcs101.dev.ttw/svn/webfleet/trunk/WF.Components/WF.components/profiling/src' at -1 into '/var/lib/jenkins/jobs/TRCWriter.trunk/workspace/Ivy-Migration/wfComponents/profiling/src'
At revision 54800
Fetching 'https://ttbsvcs101.dev.ttw/svn/webfleet/trunk/WF.Components/WF.components/reportingstorage/src' at -1 into '/var/lib/jenkins/jobs/TRCWriter.trunk/workspace/Ivy-Migration/wfComponents/reportingstorage/src'
At revision 54800
Fetching 'https://ttbsvcs101.dev.ttw/svn/webfleet/trunk/WF.Components/WF.components/reportingstorage/test-src' at -1 into '/var/lib/jenkins/jobs/TRCWriter.trunk/workspace/Ivy-Migration/wfComponents/reportingstorage/test-src'
At revision 54800
Fetching 'https://ttbsvcs101.dev.ttw/svn/webfleet/trunk/WF.Components/WF.components/jms/src' at -1 into '/var/lib/jenkins/jobs/TRCWriter.trunk/workspace/Ivy-Migration/wfComponents/jms/src'
At revision 54800
Fetching 'https://ttbsvcs101.dev.ttw/svn/webfleet/trunk/WF.Components/WF.components/jms/test-src' at -1 into '/var/lib/jenkins/jobs/TRCWriter.trunk/workspace/Ivy-Migration/wfComponents/jms/test-src'
At revision 54800
Fetching 'https://ttbsvcs101.dev.ttw/svn/webfleet/trunk/WF.Components/WF.components/webdavclient/src' at -1 into '/var/lib/jenkins/jobs/TRCWriter.trunk/workspace/Ivy-Migration/wfComponents/webdavclient/src'
At revision 54800
Fetching 'https://ttbsvcs101.dev.ttw/svn/webfleet/trunk/WF.Components/WF.components/webdavclient/test-src' at -1 into '/var/lib/jenkins/jobs/TRCWriter.trunk/workspace/Ivy-Migration/wfComponents/webdavclient/test-src'
At revision 54800
Fetching 'https://ttbsvcs101.dev.ttw/svn/webfleet/trunk/WF.Components/WF.components/base/src' at -1 into '/var/lib/jenkins/jobs/TRCWriter.trunk/workspace/Ivy-Migration/wfComponents/base/src'
At revision 54800
Fetching 'https://ttbsvcs101.dev.ttw/svn/webfleet/trunk/WF.Components/WF.components/base/test-src' at -1 into '/var/lib/jenkins/jobs/TRCWriter.trunk/workspace/Ivy-Migration/wfComponents/base/test-src'
At revision 54800
Fetching 'https://ttbsvcs101.dev.ttw/svn/webfleet/trunk/WF.Components/WF.components/messaging-api/src' at -1 into '/var/lib/jenkins/jobs/TRCWriter.trunk/workspace/Ivy-Migration/wfComponents/messaging-api/src'
At revision 54800
Fetching 'https://ttbsvcs101.dev.ttw/svn/webfleet/trunk/WF.Components/WF.components/messaging-api/test-src' at -1 into '/var/lib/jenkins/jobs/TRCWriter.trunk/workspace/Ivy-Migration/wfComponents/messaging-api/test-src'
At revision 54800
Fetching 'https://ttbsvcs101.dev.ttw/svn/webfleet/trunk/WF.Components/WF.components/translation/src' at -1 into '/var/lib/jenkins/jobs/TRCWriter.trunk/workspace/Ivy-Migration/wfComponents/translation/src'
At revision 54800
Fetching 'https://ttbsvcs101.dev.ttw/svn/webfleet/trunk/WF.Components/WF.components/userAuthPermissions/src' at -1 into '/var/lib/jenkins/jobs/TRCWriter.trunk/workspace/Ivy-Migration/wfComponents/userAuthPermissions/src'
At revision 54800
Fetching 'https://ttbsvcs101.dev.ttw/svn/webfleet/trunk/WF.Components/WF.components/userAuthPermissions/test-src' at -1 into '/var/lib/jenkins/jobs/TRCWriter.trunk/workspace/Ivy-Migration/wfComponents/userAuthPermissions/test-src'
At revision 54800
Fetching 'https://ttbsvcs101.dev.ttw/svn/webfleet/trunk/WF.Components/WF.components/httpclient/src' at -1 into '/var/lib/jenkins/jobs/TRCWriter.trunk/workspace/Ivy-Migration/wfComponents/httpclient/src'
At revision 54800
Fetching 'https://ttbsvcs101.dev.ttw/svn/webfleet/trunk/WF.Components/WF.components/httpclient/test-src' at -1 into '/var/lib/jenkins/jobs/TRCWriter.trunk/workspace/Ivy-Migration/wfComponents/httpclient/test-src'
At revision 54800
Fetching 'https://ttbsvcs101.dev.ttw/svn/webfleet/trunk/WF.Components/WF.components/resourcestore/src' at -1 into '/var/lib/jenkins/jobs/TRCWriter.trunk/workspace/Ivy-Migration/wfComponents/resourcestore/src'
At revision 54800
Fetching 'https://ttbsvcs101.dev.ttw/svn/webfleet/trunk/WF.Components/WF.components/resourcestore/testfiles' at -1 into '/var/lib/jenkins/jobs/TRCWriter.trunk/workspace/Ivy-Migration/wfComponents/resourcestore/testfiles'
At revision 54800
Fetching 'https://ttbsvcs101.dev.ttw/svn/webfleet/trunk/WF.Components/WF.components/resourcestore/test-src' at -1 into '/var/lib/jenkins/jobs/TRCWriter.trunk/workspace/Ivy-Migration/wfComponents/resourcestore/test-src'
At revision 54800
Fetching 'https://ttbsvcs101.dev.ttw/svn/webfleet/trunk/WF.Components/WF.components/passwordvalidation/src' at -1 into '/var/lib/jenkins/jobs/TRCWriter.trunk/workspace/Ivy-Migration/wfComponents/passwordvalidation/src'
At revision 54800
Fetching 'https://ttbsvcs101.dev.ttw/svn/webfleet/trunk/WF.Components/WF.components/passwordvalidation/test-src' at -1 into '/var/lib/jenkins/jobs/TRCWriter.trunk/workspace/Ivy-Migration/wfComponents/passwordvalidation/test-src'
At revision 54800
Fetching 'https://ttbsvcs101.dev.ttw/svn/webfleet/trunk/WF.Components/WF.components/codecoverage/cobertura-include.xml' at -1 into '/var/lib/jenkins/jobs/TRCWriter.trunk/workspace/Ivy-Migration/wfComponents/codecoverage/cobertura-include.xml'
At revision 54800
Fetching 'https://ttbsvcs101.dev.ttw/svn/webfleet/trunk/WF.Components/WF.components/codecoverage/src' at -1 into '/var/lib/jenkins/jobs/TRCWriter.trunk/workspace/Ivy-Migration/wfComponents/codecoverage/src'
At revision 54800
Fetching 'https://ttbsvcs101.dev.ttw/svn/webfleet/trunk/WF.Components/WF.components/codecoverage/webapp' at -1 into '/var/lib/jenkins/jobs/TRCWriter.trunk/workspace/Ivy-Migration/wfComponents/codecoverage/webapp'
At revision 54800
Fetching 'https://ttbsvcs101.dev.ttw/svn/webfleet/trunk/WF.Components/WF.components/session/SessionComponent.properties' at -1 into '/var/lib/jenkins/jobs/TRCWriter.trunk/workspace/Ivy-Migration/wfComponents/session/SessionComponent.properties'
At revision 54800
Fetching 'https://ttbsvcs101.dev.ttw/svn/webfleet/trunk/WF.Components/WF.components/session/src' at -1 into '/var/lib/jenkins/jobs/TRCWriter.trunk/workspace/Ivy-Migration/wfComponents/session/src'
At revision 54800
Fetching 'https://ttbsvcs101.dev.ttw/svn/webfleet/trunk/WF.Components/WF.components/session/test-src' at -1 into '/var/lib/jenkins/jobs/TRCWriter.trunk/workspace/Ivy-Migration/wfComponents/session/test-src'
At revision 54800
Fetching 'https://ttbsvcs101.dev.ttw/svn/webfleet/trunk/WF.Components/WF.components/amfserialization/src' at -1 into '/var/lib/jenkins/jobs/TRCWriter.trunk/workspace/Ivy-Migration/wfComponents/amfserialization/src'
At revision 54800
Fetching 'https://ttbsvcs101.dev.ttw/svn/webfleet/trunk/WF.Components/WF.components/httpJetty/src' at -1 into '/var/lib/jenkins/jobs/TRCWriter.trunk/workspace/Ivy-Migration/wfComponents/httpJetty/src'
At revision 54800
Fetching 'https://ttbsvcs101.dev.ttw/svn/webfleet/trunk/WF.Components/WF.components/middleTierSupport/desc' at -1 into '/var/lib/jenkins/jobs/TRCWriter.trunk/workspace/Ivy-Migration/wfComponents/middleTierSupport/desc'
At revision 54800
Fetching 'https://ttbsvcs101.dev.ttw/svn/webfleet/trunk/WF.Components/WF.components/middleTierSupport/src' at -1 into '/var/lib/jenkins/jobs/TRCWriter.trunk/workspace/Ivy-Migration/wfComponents/middleTierSupport/src'
U         middleTierSupport/src/beans-middle-tier-jee-adapter.xml
U         middleTierSupport/src/beans-middle-tier-standalone-adapter.xml
U         middleTierSupport/src/beans-middle-tier-common.xml
At revision 54800
Fetching 'https://ttbsvcs101.dev.ttw/svn/webfleet/trunk/WF.Components/WF.components/middleTierSupport/test-src' at -1 into '/var/lib/jenkins/jobs/TRCWriter.trunk/workspace/Ivy-Migration/wfComponents/middleTierSupport/test-src'
At revision 54800
Fetching 'https://ttbsvcs101.dev.ttw/svn/webfleet/trunk/WF.Components/WF.components/binaryprotocol/src' at -1 into '/var/lib/jenkins/jobs/TRCWriter.trunk/workspace/Ivy-Migration/wfComponents/binaryprotocol/src'
At revision 54800
Fetching 'https://ttbsvcs101.dev.ttw/svn/webfleet/trunk/WF.Components/WF.components/binaryprotocol/test-src' at -1 into '/var/lib/jenkins/jobs/TRCWriter.trunk/workspace/Ivy-Migration/wfComponents/binaryprotocol/test-src'
At revision 54800
Fetching 'https://ttbsvcs101.dev.ttw/svn/webfleet/trunk/WF.Components/WF.components/email/src' at -1 into '/var/lib/jenkins/jobs/TRCWriter.trunk/workspace/Ivy-Migration/wfComponents/email/src'
At revision 54800
Fetching 'https://ttbsvcs101.dev.ttw/svn/webfleet/trunk/WF.Components/WF.components/lbs/build.properties' at -1 into '/var/lib/jenkins/jobs/TRCWriter.trunk/workspace/Ivy-Migration/wfComponents/lbs/build.properties'
At revision 54800
Fetching 'https://ttbsvcs101.dev.ttw/svn/webfleet/trunk/WF.Components/WF.components/lbs/src' at -1 into '/var/lib/jenkins/jobs/TRCWriter.trunk/workspace/Ivy-Migration/wfComponents/lbs/src'
At revision 54800
Fetching 'https://ttbsvcs101.dev.ttw/svn/webfleet/trunk/WF.Components/WF.components/lbs/test-src' at -1 into '/var/lib/jenkins/jobs/TRCWriter.trunk/workspace/Ivy-Migration/wfComponents/lbs/test-src'
At revision 54800
Fetching 'https://ttbsvcs101.dev.ttw/svn/webfleet/trunk/WF.Components/WF.components/transaction/src' at -1 into '/var/lib/jenkins/jobs/TRCWriter.trunk/workspace/Ivy-Migration/wfComponents/transaction/src'
At revision 54800
At revision 54800
Cleaning up /var/lib/jenkins/jobs/TRCWriter.trunk/workspace/Common
Updating https://ttbsvcs101.dev.ttw/svn/webfleet/trunk/Common at revision '2014-02-05T08:58:02.421 +0100'
At revision 54800
no change for https://ttbsvcs101.dev.ttw/svn/webfleet/trunk/TRCWriter since the previous build
no change for https://ttbsvcs101.dev.ttw/svn/webfleet/trunk/Ivy-Migration/wfComponents since the previous build
no change for https://ttbsvcs101.dev.ttw/svn/webfleet/trunk/Common since the previous build
no change for https://ttbsvcs101.dev.ttw/svn/webfleet/trunk/WF.Components/WF.components/pushapi/src since the previous build
no change for https://ttbsvcs101.dev.ttw/svn/webfleet/trunk/WF.Components/WF.components/cacheinvalidation/src since the previous build
no change for https://ttbsvcs101.dev.ttw/svn/webfleet/trunk/WF.Components/WF.components/cacheinvalidation/test since the previous build
no change for https://ttbsvcs101.dev.ttw/svn/webfleet/trunk/WF.Components/WF.components/cache/run-test-client.bat since the previous build
no change for https://ttbsvcs101.dev.ttw/svn/webfleet/trunk/WF.Components/WF.components/cache/src since the previous build
no change for https://ttbsvcs101.dev.ttw/svn/webfleet/trunk/WF.Components/WF.components/cache/test-properties since the previous build
no change for https://ttbsvcs101.dev.ttw/svn/webfleet/trunk/WF.Components/WF.components/cache/test-src since the previous build
no change for https://ttbsvcs101.dev.ttw/svn/webfleet/trunk/WF.Components/WF.components/settings/src since the previous build
no change for https://ttbsvcs101.dev.ttw/svn/webfleet/trunk/WF.Components/WF.components/asynccommands/src since the previous build
no change for https://ttbsvcs101.dev.ttw/svn/webfleet/trunk/WF.Components/WF.components/asynccommands/test-src since the previous build
no change for https://ttbsvcs101.dev.ttw/svn/webfleet/trunk/WF.Components/WF.components/datasource/src since the previous build
no change for https://ttbsvcs101.dev.ttw/svn/webfleet/trunk/WF.Components/WF.components/quotacontrol/src since the previous build
no change for https://ttbsvcs101.dev.ttw/svn/webfleet/trunk/WF.Components/WF.components/profiling/build since the previous build
no change for https://ttbsvcs101.dev.ttw/svn/webfleet/trunk/WF.Components/WF.components/profiling/src since the previous build
no change for https://ttbsvcs101.dev.ttw/svn/webfleet/trunk/WF.Components/WF.components/reportingstorage/src since the previous build
no change for https://ttbsvcs101.dev.ttw/svn/webfleet/trunk/WF.Components/WF.components/reportingstorage/test-src since the previous build
no change for https://ttbsvcs101.dev.ttw/svn/webfleet/trunk/WF.Components/WF.components/jms/src since the previous build
no change for https://ttbsvcs101.dev.ttw/svn/webfleet/trunk/WF.Components/WF.components/jms/test-src since the previous build
no change for https://ttbsvcs101.dev.ttw/svn/webfleet/trunk/WF.Components/WF.components/webdavclient/src since the previous build
no change for https://ttbsvcs101.dev.ttw/svn/webfleet/trunk/WF.Components/WF.components/webdavclient/test-src since the previous build
no change for https://ttbsvcs101.dev.ttw/svn/webfleet/trunk/WF.Components/WF.components/base/src since the previous build
no change for https://ttbsvcs101.dev.ttw/svn/webfleet/trunk/WF.Components/WF.components/base/test-src since the previous build
no change for https://ttbsvcs101.dev.ttw/svn/webfleet/trunk/WF.Components/WF.components/messaging-api/src since the previous build
no change for https://ttbsvcs101.dev.ttw/svn/webfleet/trunk/WF.Components/WF.components/messaging-api/test-src since the previous build
no change for https://ttbsvcs101.dev.ttw/svn/webfleet/trunk/WF.Components/WF.components/translation/src since the previous build
no change for https://ttbsvcs101.dev.ttw/svn/webfleet/trunk/WF.Components/WF.components/userAuthPermissions/src since the previous build
no change for https://ttbsvcs101.dev.ttw/svn/webfleet/trunk/WF.Components/WF.components/userAuthPermissions/test-src since the previous build
no change for https://ttbsvcs101.dev.ttw/svn/webfleet/trunk/WF.Components/WF.components/httpclient/src since the previous build
no change for https://ttbsvcs101.dev.ttw/svn/webfleet/trunk/WF.Components/WF.components/httpclient/test-src since the previous build
no change for https://ttbsvcs101.dev.ttw/svn/webfleet/trunk/WF.Components/WF.components/resourcestore/src since the previous build
no change for https://ttbsvcs101.dev.ttw/svn/webfleet/trunk/WF.Components/WF.components/resourcestore/testfiles since the previous build
no change for https://ttbsvcs101.dev.ttw/svn/webfleet/trunk/WF.Components/WF.components/resourcestore/test-src since the previous build
no change for https://ttbsvcs101.dev.ttw/svn/webfleet/trunk/WF.Components/WF.components/passwordvalidation/src since the previous build
no change for https://ttbsvcs101.dev.ttw/svn/webfleet/trunk/WF.Components/WF.components/passwordvalidation/test-src since the previous build
no change for https://ttbsvcs101.dev.ttw/svn/webfleet/trunk/WF.Components/WF.components/codecoverage/cobertura-include.xml since the previous build
no change for https://ttbsvcs101.dev.ttw/svn/webfleet/trunk/WF.Components/WF.components/codecoverage/src since the previous build
no change for https://ttbsvcs101.dev.ttw/svn/webfleet/trunk/WF.Components/WF.components/codecoverage/webapp since the previous build
no change for https://ttbsvcs101.dev.ttw/svn/webfleet/trunk/WF.Components/WF.components/session/SessionComponent.properties since the previous build
no change for https://ttbsvcs101.dev.ttw/svn/webfleet/trunk/WF.Components/WF.components/session/src since the previous build
no change for https://ttbsvcs101.dev.ttw/svn/webfleet/trunk/WF.Components/WF.components/session/test-src since the previous build
no change for https://ttbsvcs101.dev.ttw/svn/webfleet/trunk/WF.Components/WF.components/amfserialization/src since the previous build
no change for https://ttbsvcs101.dev.ttw/svn/webfleet/trunk/WF.Components/WF.components/httpJetty/src since the previous build
no change for https://ttbsvcs101.dev.ttw/svn/webfleet/trunk/WF.Components/WF.components/middleTierSupport/desc since the previous build
hudson.util.IOException2: revision check failed on https://ttbsvcs101.dev.ttw/svn/webfleet/trunk/WF.Components/WF.components/middleTierSupport/src
	at hudson.scm.SubversionChangeLogBuilder.buildModule(SubversionChangeLogBuilder.java:189)
	at hudson.scm.SubversionChangeLogBuilder.run(SubversionChangeLogBuilder.java:132)
	at hudson.scm.SubversionSCM.calcChangeLog(SubversionSCM.java:733)
	at hudson.scm.SubversionSCM.checkout(SubversionSCM.java:894)
	at hudson.model.AbstractProject.checkout(AbstractProject.java:1411)
	at hudson.model.AbstractBuild$AbstractBuildExecution.defaultCheckout(AbstractBuild.java:652)
	at jenkins.scm.SCMCheckoutStrategy.checkout(SCMCheckoutStrategy.java:88)
	at hudson.model.AbstractBuild$AbstractBuildExecution.run(AbstractBuild.java:557)
	at hudson.model.Run.execute(Run.java:1665)
	at hudson.model.FreeStyleBuild.run(FreeStyleBuild.java:46)
	at hudson.model.ResourceController.execute(ResourceController.java:88)
	at hudson.model.Executor.run(Executor.java:246)
Caused by: org.tmatesoft.svn.core.SVNException: svn: E175002: REPORT /svn/webfleet/!svn/bc/54800/trunk/WF.Components/WF.components/middleTierSupport/src failed
	at org.tmatesoft.svn.core.internal.io.dav.http.HTTPConnection.request(HTTPConnection.java:386)
	at org.tmatesoft.svn.core.internal.io.dav.http.HTTPConnection.request(HTTPConnection.java:373)
	at org.tmatesoft.svn.core.internal.io.dav.http.HTTPConnection.request(HTTPConnection.java:361)
	at org.tmatesoft.svn.core.internal.io.dav.DAVConnection.performHttpRequest(DAVConnection.java:707)
	at org.tmatesoft.svn.core.internal.io.dav.DAVConnection.doReport(DAVConnection.java:334)
	at org.tmatesoft.svn.core.internal.io.dav.DAVConnection.doReport(DAVConnection.java:324)
	at org.tmatesoft.svn.core.internal.io.dav.DAVRepository.logImpl(DAVRepository.java:995)
	at org.tmatesoft.svn.core.io.SVNRepository.log(SVNRepository.java:1035)
	at org.tmatesoft.svn.core.internal.wc2.remote.SvnRemoteLog.run(SvnRemoteLog.java:181)
	at org.tmatesoft.svn.core.internal.wc2.remote.SvnRemoteLog.run(SvnRemoteLog.java:35)
	at org.tmatesoft.svn.core.internal.wc2.SvnOperationRunner.run(SvnOperationRunner.java:20)
	at org.tmatesoft.svn.core.wc2.SvnOperationFactory.run(SvnOperationFactory.java:1238)
	at org.tmatesoft.svn.core.wc2.SvnOperation.run(SvnOperation.java:294)
	at org.tmatesoft.svn.core.wc.SVNLogClient.doLog(SVNLogClient.java:967)
	at org.tmatesoft.svn.core.wc.SVNLogClient.doLog(SVNLogClient.java:872)
	at hudson.scm.SubversionChangeLogBuilder.buildModule(SubversionChangeLogBuilder.java:177)
	... 11 more
Caused by: svn: E175002: REPORT /svn/webfleet/!svn/bc/54800/trunk/WF.Components/WF.components/middleTierSupport/src failed
	at org.tmatesoft.svn.core.SVNErrorMessage.create(SVNErrorMessage.java:208)
	at org.tmatesoft.svn.core.SVNErrorMessage.create(SVNErrorMessage.java:154)
	at org.tmatesoft.svn.core.SVNErrorMessage.create(SVNErrorMessage.java:97)
	... 27 more
Caused by: java.lang.StringIndexOutOfBoundsException: String index out of range: -1
	at java.lang.String.substring(String.java:1949)
	at java.lang.String.substring(String.java:1916)
	at hudson.scm.DirAwareSVNXMLLogHandler.handleLogEntry(DirAwareSVNXMLLogHandler.java:90)
	at org.tmatesoft.svn.core.internal.wc2.compat.SvnCodec$7.receive(SvnCodec.java:167)
	at org.tmatesoft.svn.core.internal.wc2.compat.SvnCodec$7.receive(SvnCodec.java:164)
	at org.tmatesoft.svn.core.wc2.SvnReceivingOperation.receive(SvnReceivingOperation.java:78)
	at org.tmatesoft.svn.core.internal.wc2.remote.SvnRemoteLog.handleLogEntry(SvnRemoteLog.java:199)
	at org.tmatesoft.svn.core.internal.io.dav.DAVRepository$1.handleLogEntry(DAVRepository.java:950)
	at org.tmatesoft.svn.core.internal.io.dav.handlers.DAVLogHandler.endElement(DAVLogHandler.java:226)
	at org.tmatesoft.svn.core.internal.io.dav.handlers.BasicDAVHandler.endElement(BasicDAVHandler.java:103)
	at com.sun.org.apache.xerces.internal.parsers.AbstractSAXParser.endElement(AbstractSAXParser.java:604)
	at com.sun.org.apache.xerces.internal.impl.XMLDocumentFragmentScannerImpl.scanEndElement(XMLDocumentFragmentScannerImpl.java:1759)
	at com.sun.org.apache.xerces.internal.impl.XMLDocumentFragmentScannerImpl$FragmentContentDriver.next(XMLDocumentFragmentScannerImpl.java:2915)
	at com.sun.org.apache.xerces.internal.impl.XMLDocumentScannerImpl.next(XMLDocumentScannerImpl.java:625)
	at com.sun.org.apache.xerces.internal.impl.XMLNSDocumentScannerImpl.next(XMLNSDocumentScannerImpl.java:116)
	at com.sun.org.apache.xerces.internal.impl.XMLDocumentFragmentScannerImpl.scanDocument(XMLDocumentFragmentScannerImpl.java:488)
	at com.sun.org.apache.xerces.internal.parsers.XML11Configuration.parse(XML11Configuration.java:819)
	at com.sun.org.apache.xerces.internal.parsers.XML11Configuration.parse(XML11Configuration.java:748)
	at com.sun.org.apache.xerces.internal.parsers.XMLParser.parse(XMLParser.java:123)
	at com.sun.org.apache.xerces.internal.parsers.AbstractSAXParser.parse(AbstractSAXParser.java:1208)
	at com.sun.org.apache.xerces.internal.jaxp.SAXParserImpl$JAXPSAXParser.parse(SAXParserImpl.java:525)
	at org.tmatesoft.svn.core.internal.io.dav.http.HTTPConnection.readData(HTTPConnection.java:911)
	at org.tmatesoft.svn.core.internal.io.dav.http.HTTPConnection.readData(HTTPConnection.java:876)
	at org.tmatesoft.svn.core.internal.io.dav.http.HTTPRequest.dispatch(HTTPRequest.java:220)
	at org.tmatesoft.svn.core.internal.io.dav.http.HTTPConnection._request(HTTPConnection.java:480)
	at org.tmatesoft.svn.core.internal.io.dav.http.HTTPConnection.request(HTTPConnection.java:382)
	... 26 more
Retrying after 10 seconds
Cleaning up /var/lib/jenkins/jobs/TRCWriter.trunk/workspace/TRCWriter
Updating https://ttbsvcs101.dev.ttw/svn/webfleet/trunk/TRCWriter at revision '2014-02-05T08:58:02.421 +0100'
At revision 54800
Cleaning up /var/lib/jenkins/jobs/TRCWriter.trunk/workspace/Ivy-Migration/wfComponents
Updating https://ttbsvcs101.dev.ttw/svn/webfleet/trunk/Ivy-Migration/wfComponents at revision '2014-02-05T08:58:02.421 +0100'
Fetching 'https://ttbsvcs101.dev.ttw/svn/webfleet/trunk/WF.Components/WF.components/pushapi/src' at -1 into '/var/lib/jenkins/jobs/TRCWriter.trunk/workspace/Ivy-Migration/wfComponents/pushapi/src'
At revision 54800
Fetching 'https://ttbsvcs101.dev.ttw/svn/webfleet/trunk/WF.Components/WF.components/cacheinvalidation/src' at -1 into '/var/lib/jenkins/jobs/TRCWriter.trunk/workspace/Ivy-Migration/wfComponents/cacheinvalidation/src'
At revision 54800
Fetching 'https://ttbsvcs101.dev.ttw/svn/webfleet/trunk/WF.Components/WF.components/cacheinvalidation/test' at -1 into '/var/lib/jenkins/jobs/TRCWriter.trunk/workspace/Ivy-Migration/wfComponents/cacheinvalidation/test-src'
At revision 54800
Fetching 'https://ttbsvcs101.dev.ttw/svn/webfleet/trunk/WF.Components/WF.components/cache/run-test-client.bat' at -1 into '/var/lib/jenkins/jobs/TRCWriter.trunk/workspace/Ivy-Migration/wfComponents/cache/run-test-client.bat'
At revision 54800
Fetching 'https://ttbsvcs101.dev.ttw/svn/webfleet/trunk/WF.Components/WF.components/cache/src' at -1 into '/var/lib/jenkins/jobs/TRCWriter.trunk/workspace/Ivy-Migration/wfComponents/cache/src'
At revision 54800
Fetching 'https://ttbsvcs101.dev.ttw/svn/webfleet/trunk/WF.Components/WF.components/cache/test-properties' at -1 into '/var/lib/jenkins/jobs/TRCWriter.trunk/workspace/Ivy-Migration/wfComponents/cache/test-properties'
At revision 54800
Fetching 'https://ttbsvcs101.dev.ttw/svn/webfleet/trunk/WF.Components/WF.components/cache/test-src' at -1 into '/var/lib/jenkins/jobs/TRCWriter.trunk/workspace/Ivy-Migration/wfComponents/cache/test-src'
At revision 54800
Fetching 'https://ttbsvcs101.dev.ttw/svn/webfleet/trunk/WF.Components/WF.components/settings/src' at -1 into '/var/lib/jenkins/jobs/TRCWriter.trunk/workspace/Ivy-Migration/wfComponents/settings/src'
At revision 54800
Fetching 'https://ttbsvcs101.dev.ttw/svn/webfleet/trunk/WF.Components/WF.components/asynccommands/src' at -1 into '/var/lib/jenkins/jobs/TRCWriter.trunk/workspace/Ivy-Migration/wfComponents/asynccommands/src'
At revision 54800
Fetching 'https://ttbsvcs101.dev.ttw/svn/webfleet/trunk/WF.Components/WF.components/asynccommands/test-src' at -1 into '/var/lib/jenkins/jobs/TRCWriter.trunk/workspace/Ivy-Migration/wfComponents/asynccommands/test-src'
At revision 54800
Fetching 'https://ttbsvcs101.dev.ttw/svn/webfleet/trunk/WF.Components/WF.components/datasource/src' at -1 into '/var/lib/jenkins/jobs/TRCWriter.trunk/workspace/Ivy-Migration/wfComponents/datasource/src'
At revision 54800
Fetching 'https://ttbsvcs101.dev.ttw/svn/webfleet/trunk/WF.Components/WF.components/quotacontrol/src' at -1 into '/var/lib/jenkins/jobs/TRCWriter.trunk/workspace/Ivy-Migration/wfComponents/quotacontrol/src'
At revision 54800
Fetching 'https://ttbsvcs101.dev.ttw/svn/webfleet/trunk/WF.Components/WF.components/profiling/build' at -1 into '/var/lib/jenkins/jobs/TRCWriter.trunk/workspace/Ivy-Migration/wfComponents/profiling/build'
At revision 54800
Fetching 'https://ttbsvcs101.dev.ttw/svn/webfleet/trunk/WF.Components/WF.components/profiling/src' at -1 into '/var/lib/jenkins/jobs/TRCWriter.trunk/workspace/Ivy-Migration/wfComponents/profiling/src'
At revision 54800
Fetching 'https://ttbsvcs101.dev.ttw/svn/webfleet/trunk/WF.Components/WF.components/reportingstorage/src' at -1 into '/var/lib/jenkins/jobs/TRCWriter.trunk/workspace/Ivy-Migration/wfComponents/reportingstorage/src'
At revision 54800
Fetching 'https://ttbsvcs101.dev.ttw/svn/webfleet/trunk/WF.Components/WF.components/reportingstorage/test-src' at -1 into '/var/lib/jenkins/jobs/TRCWriter.trunk/workspace/Ivy-Migration/wfComponents/reportingstorage/test-src'
At revision 54800
Fetching 'https://ttbsvcs101.dev.ttw/svn/webfleet/trunk/WF.Components/WF.components/jms/src' at -1 into '/var/lib/jenkins/jobs/TRCWriter.trunk/workspace/Ivy-Migration/wfComponents/jms/src'
At revision 54800
Fetching 'https://ttbsvcs101.dev.ttw/svn/webfleet/trunk/WF.Components/WF.components/jms/test-src' at -1 into '/var/lib/jenkins/jobs/TRCWriter.trunk/workspace/Ivy-Migration/wfComponents/jms/test-src'
At revision 54800
Fetching 'https://ttbsvcs101.dev.ttw/svn/webfleet/trunk/WF.Components/WF.components/webdavclient/src' at -1 into '/var/lib/jenkins/jobs/TRCWriter.trunk/workspace/Ivy-Migration/wfComponents/webdavclient/src'
At revision 54800
Fetching 'https://ttbsvcs101.dev.ttw/svn/webfleet/trunk/WF.Components/WF.components/webdavclient/test-src' at -1 into '/var/lib/jenkins/jobs/TRCWriter.trunk/workspace/Ivy-Migration/wfComponents/webdavclient/test-src'
At revision 54800
Fetching 'https://ttbsvcs101.dev.ttw/svn/webfleet/trunk/WF.Components/WF.components/base/src' at -1 into '/var/lib/jenkins/jobs/TRCWriter.trunk/workspace/Ivy-Migration/wfComponents/base/src'
At revision 54800
Fetching 'https://ttbsvcs101.dev.ttw/svn/webfleet/trunk/WF.Components/WF.components/base/test-src' at -1 into '/var/lib/jenkins/jobs/TRCWriter.trunk/workspace/Ivy-Migration/wfComponents/base/test-src'
At revision 54800
Fetching 'https://ttbsvcs101.dev.ttw/svn/webfleet/trunk/WF.Components/WF.components/messaging-api/src' at -1 into '/var/lib/jenkins/jobs/TRCWriter.trunk/workspace/Ivy-Migration/wfComponents/messaging-api/src'
At revision 54800
Fetching 'https://ttbsvcs101.dev.ttw/svn/webfleet/trunk/WF.Components/WF.components/messaging-api/test-src' at -1 into '/var/lib/jenkins/jobs/TRCWriter.trunk/workspace/Ivy-Migration/wfComponents/messaging-api/test-src'
At revision 54800
Fetching 'https://ttbsvcs101.dev.ttw/svn/webfleet/trunk/WF.Components/WF.components/translation/src' at -1 into '/var/lib/jenkins/jobs/TRCWriter.trunk/workspace/Ivy-Migration/wfComponents/translation/src'
At revision 54800
Fetching 'https://ttbsvcs101.dev.ttw/svn/webfleet/trunk/WF.Components/WF.components/userAuthPermissions/src' at -1 into '/var/lib/jenkins/jobs/TRCWriter.trunk/workspace/Ivy-Migration/wfComponents/userAuthPermissions/src'
At revision 54800
Fetching 'https://ttbsvcs101.dev.ttw/svn/webfleet/trunk/WF.Components/WF.components/userAuthPermissions/test-src' at -1 into '/var/lib/jenkins/jobs/TRCWriter.trunk/workspace/Ivy-Migration/wfComponents/userAuthPermissions/test-src'
At revision 54800
Fetching 'https://ttbsvcs101.dev.ttw/svn/webfleet/trunk/WF.Components/WF.components/httpclient/src' at -1 into '/var/lib/jenkins/jobs/TRCWriter.trunk/workspace/Ivy-Migration/wfComponents/httpclient/src'
At revision 54800
Fetching 'https://ttbsvcs101.dev.ttw/svn/webfleet/trunk/WF.Components/WF.components/httpclient/test-src' at -1 into '/var/lib/jenkins/jobs/TRCWriter.trunk/workspace/Ivy-Migration/wfComponents/httpclient/test-src'
At revision 54800
Fetching 'https://ttbsvcs101.dev.ttw/svn/webfleet/trunk/WF.Components/WF.components/resourcestore/src' at -1 into '/var/lib/jenkins/jobs/TRCWriter.trunk/workspace/Ivy-Migration/wfComponents/resourcestore/src'
At revision 54800
Fetching 'https://ttbsvcs101.dev.ttw/svn/webfleet/trunk/WF.Components/WF.components/resourcestore/testfiles' at -1 into '/var/lib/jenkins/jobs/TRCWriter.trunk/workspace/Ivy-Migration/wfComponents/resourcestore/testfiles'
At revision 54800
Fetching 'https://ttbsvcs101.dev.ttw/svn/webfleet/trunk/WF.Components/WF.components/resourcestore/test-src' at -1 into '/var/lib/jenkins/jobs/TRCWriter.trunk/workspace/Ivy-Migration/wfComponents/resourcestore/test-src'
At revision 54800
Fetching 'https://ttbsvcs101.dev.ttw/svn/webfleet/trunk/WF.Components/WF.components/passwordvalidation/src' at -1 into '/var/lib/jenkins/jobs/TRCWriter.trunk/workspace/Ivy-Migration/wfComponents/passwordvalidation/src'
At revision 54800
Fetching 'https://ttbsvcs101.dev.ttw/svn/webfleet/trunk/WF.Components/WF.components/passwordvalidation/test-src' at -1 into '/var/lib/jenkins/jobs/TRCWriter.trunk/workspace/Ivy-Migration/wfComponents/passwordvalidation/test-src'
At revision 54800
Fetching 'https://ttbsvcs101.dev.ttw/svn/webfleet/trunk/WF.Components/WF.components/codecoverage/cobertura-include.xml' at -1 into '/var/lib/jenkins/jobs/TRCWriter.trunk/workspace/Ivy-Migration/wfComponents/codecoverage/cobertura-include.xml'
At revision 54800
Fetching 'https://ttbsvcs101.dev.ttw/svn/webfleet/trunk/WF.Components/WF.components/codecoverage/src' at -1 into '/var/lib/jenkins/jobs/TRCWriter.trunk/workspace/Ivy-Migration/wfComponents/codecoverage/src'
At revision 54800
Fetching 'https://ttbsvcs101.dev.ttw/svn/webfleet/trunk/WF.Components/WF.components/codecoverage/webapp' at -1 into '/var/lib/jenkins/jobs/TRCWriter.trunk/workspace/Ivy-Migration/wfComponents/codecoverage/webapp'
At revision 54800
Fetching 'https://ttbsvcs101.dev.ttw/svn/webfleet/trunk/WF.Components/WF.components/session/SessionComponent.properties' at -1 into '/var/lib/jenkins/jobs/TRCWriter.trunk/workspace/Ivy-Migration/wfComponents/session/SessionComponent.properties'
At revision 54800
Fetching 'https://ttbsvcs101.dev.ttw/svn/webfleet/trunk/WF.Components/WF.components/session/src' at -1 into '/var/lib/jenkins/jobs/TRCWriter.trunk/workspace/Ivy-Migration/wfComponents/session/src'
At revision 54800
Fetching 'https://ttbsvcs101.dev.ttw/svn/webfleet/trunk/WF.Components/WF.components/session/test-src' at -1 into '/var/lib/jenkins/jobs/TRCWriter.trunk/workspace/Ivy-Migration/wfComponents/session/test-src'
At revision 54800
Fetching 'https://ttbsvcs101.dev.ttw/svn/webfleet/trunk/WF.Components/WF.components/amfserialization/src' at -1 into '/var/lib/jenkins/jobs/TRCWriter.trunk/workspace/Ivy-Migration/wfComponents/amfserialization/src'
At revision 54800
Fetching 'https://ttbsvcs101.dev.ttw/svn/webfleet/trunk/WF.Components/WF.components/httpJetty/src' at -1 into '/var/lib/jenkins/jobs/TRCWriter.trunk/workspace/Ivy-Migration/wfComponents/httpJetty/src'
At revision 54800
Fetching 'https://ttbsvcs101.dev.ttw/svn/webfleet/trunk/WF.Components/WF.components/middleTierSupport/desc' at -1 into '/var/lib/jenkins/jobs/TRCWriter.trunk/workspace/Ivy-Migration/wfComponents/middleTierSupport/desc'
At revision 54800
Fetching 'https://ttbsvcs101.dev.ttw/svn/webfleet/trunk/WF.Components/WF.components/middleTierSupport/src' at -1 into '/var/lib/jenkins/jobs/TRCWriter.trunk/workspace/Ivy-Migration/wfComponents/middleTierSupport/src'
At revision 54800
Fetching 'https://ttbsvcs101.dev.ttw/svn/webfleet/trunk/WF.Components/WF.components/middleTierSupport/test-src' at -1 into '/var/lib/jenkins/jobs/TRCWriter.trunk/workspace/Ivy-Migration/wfComponents/middleTierSupport/test-src'
At revision 54800
Fetching 'https://ttbsvcs101.dev.ttw/svn/webfleet/trunk/WF.Components/WF.components/binaryprotocol/src' at -1 into '/var/lib/jenkins/jobs/TRCWriter.trunk/workspace/Ivy-Migration/wfComponents/binaryprotocol/src'
At revision 54800
Fetching 'https://ttbsvcs101.dev.ttw/svn/webfleet/trunk/WF.Components/WF.components/binaryprotocol/test-src' at -1 into '/var/lib/jenkins/jobs/TRCWriter.trunk/workspace/Ivy-Migration/wfComponents/binaryprotocol/test-src'
At revision 54800
Fetching 'https://ttbsvcs101.dev.ttw/svn/webfleet/trunk/WF.Components/WF.components/email/src' at -1 into '/var/lib/jenkins/jobs/TRCWriter.trunk/workspace/Ivy-Migration/wfComponents/email/src'
At revision 54800
Fetching 'https://ttbsvcs101.dev.ttw/svn/webfleet/trunk/WF.Components/WF.components/lbs/build.properties' at -1 into '/var/lib/jenkins/jobs/TRCWriter.trunk/workspace/Ivy-Migration/wfComponents/lbs/build.properties'
At revision 54800
Fetching 'https://ttbsvcs101.dev.ttw/svn/webfleet/trunk/WF.Components/WF.components/lbs/src' at -1 into '/var/lib/jenkins/jobs/TRCWriter.trunk/workspace/Ivy-Migration/wfComponents/lbs/src'
At revision 54800
Fetching 'https://ttbsvcs101.dev.ttw/svn/webfleet/trunk/WF.Components/WF.components/lbs/test-src' at -1 into '/var/lib/jenkins/jobs/TRCWriter.trunk/workspace/Ivy-Migration/wfComponents/lbs/test-src'
At revision 54800
Fetching 'https://ttbsvcs101.dev.ttw/svn/webfleet/trunk/WF.Components/WF.components/transaction/src' at -1 into '/var/lib/jenkins/jobs/TRCWriter.trunk/workspace/Ivy-Migration/wfComponents/transaction/src'
At revision 54800
At revision 54800
Cleaning up /var/lib/jenkins/jobs/TRCWriter.trunk/workspace/Common
Updating https://ttbsvcs101.dev.ttw/svn/webfleet/trunk/Common at revision '2014-02-05T08:58:02.421 +0100'
At revision 54800
no change for https://ttbsvcs101.dev.ttw/svn/webfleet/trunk/TRCWriter since the previous build
no change for https://ttbsvcs101.dev.ttw/svn/webfleet/trunk/Ivy-Migration/wfComponents since the previous build
no change for https://ttbsvcs101.dev.ttw/svn/webfleet/trunk/Common since the previous build
no change for https://ttbsvcs101.dev.ttw/svn/webfleet/trunk/WF.Components/WF.components/pushapi/src since the previous build
no change for https://ttbsvcs101.dev.ttw/svn/webfleet/trunk/WF.Components/WF.components/cacheinvalidation/src since the previous build
no change for https://ttbsvcs101.dev.ttw/svn/webfleet/trunk/WF.Components/WF.components/cacheinvalidation/test since the previous build
no change for https://ttbsvcs101.dev.ttw/svn/webfleet/trunk/WF.Components/WF.components/cache/run-test-client.bat since the previous build
no change for https://ttbsvcs101.dev.ttw/svn/webfleet/trunk/WF.Components/WF.components/cache/src since the previous build
no change for https://ttbsvcs101.dev.ttw/svn/webfleet/trunk/WF.Components/WF.components/cache/test-properties since the previous build
no change for https://ttbsvcs101.dev.ttw/svn/webfleet/trunk/WF.Components/WF.components/cache/test-src since the previous build
no change for https://ttbsvcs101.dev.ttw/svn/webfleet/trunk/WF.Components/WF.components/settings/src since the previous build
no change for https://ttbsvcs101.dev.ttw/svn/webfleet/trunk/WF.Components/WF.components/asynccommands/src since the previous build
no change for https://ttbsvcs101.dev.ttw/svn/webfleet/trunk/WF.Components/WF.components/asynccommands/test-src since the previous build
no change for https://ttbsvcs101.dev.ttw/svn/webfleet/trunk/WF.Components/WF.components/datasource/src since the previous build
no change for https://ttbsvcs101.dev.ttw/svn/webfleet/trunk/WF.Components/WF.components/quotacontrol/src since the previous build
no change for https://ttbsvcs101.dev.ttw/svn/webfleet/trunk/WF.Components/WF.components/profiling/build since the previous build
no change for https://ttbsvcs101.dev.ttw/svn/webfleet/trunk/WF.Components/WF.components/profiling/src since the previous build
no change for https://ttbsvcs101.dev.ttw/svn/webfleet/trunk/WF.Components/WF.components/reportingstorage/src since the previous build
no change for https://ttbsvcs101.dev.ttw/svn/webfleet/trunk/WF.Components/WF.components/reportingstorage/test-src since the previous build
no change for https://ttbsvcs101.dev.ttw/svn/webfleet/trunk/WF.Components/WF.components/jms/src since the previous build
no change for https://ttbsvcs101.dev.ttw/svn/webfleet/trunk/WF.Components/WF.components/jms/test-src since the previous build
no change for https://ttbsvcs101.dev.ttw/svn/webfleet/trunk/WF.Components/WF.components/webdavclient/src since the previous build
no change for https://ttbsvcs101.dev.ttw/svn/webfleet/trunk/WF.Components/WF.components/webdavclient/test-src since the previous build
no change for https://ttbsvcs101.dev.ttw/svn/webfleet/trunk/WF.Components/WF.components/base/src since the previous build
no change for https://ttbsvcs101.dev.ttw/svn/webfleet/trunk/WF.Components/WF.components/base/test-src since the previous build
no change for https://ttbsvcs101.dev.ttw/svn/webfleet/trunk/WF.Components/WF.components/messaging-api/src since the previous build
no change for https://ttbsvcs101.dev.ttw/svn/webfleet/trunk/WF.Components/WF.components/messaging-api/test-src since the previous build
no change for https://ttbsvcs101.dev.ttw/svn/webfleet/trunk/WF.Components/WF.components/translation/src since the previous build
no change for https://ttbsvcs101.dev.ttw/svn/webfleet/trunk/WF.Components/WF.components/userAuthPermissions/src since the previous build
no change for https://ttbsvcs101.dev.ttw/svn/webfleet/trunk/WF.Components/WF.components/userAuthPermissions/test-src since the previous build
no change for https://ttbsvcs101.dev.ttw/svn/webfleet/trunk/WF.Components/WF.components/httpclient/src since the previous build
no change for https://ttbsvcs101.dev.ttw/svn/webfleet/trunk/WF.Components/WF.components/httpclient/test-src since the previous build
no change for https://ttbsvcs101.dev.ttw/svn/webfleet/trunk/WF.Components/WF.components/resourcestore/src since the previous build
no change for https://ttbsvcs101.dev.ttw/svn/webfleet/trunk/WF.Components/WF.components/resourcestore/testfiles since the previous build
no change for https://ttbsvcs101.dev.ttw/svn/webfleet/trunk/WF.Components/WF.components/resourcestore/test-src since the previous build
no change for https://ttbsvcs101.dev.ttw/svn/webfleet/trunk/WF.Components/WF.components/passwordvalidation/src since the previous build
no change for https://ttbsvcs101.dev.ttw/svn/webfleet/trunk/WF.Components/WF.components/passwordvalidation/test-src since the previous build
no change for https://ttbsvcs101.dev.ttw/svn/webfleet/trunk/WF.Components/WF.components/codecoverage/cobertura-include.xml since the previous build
no change for https://ttbsvcs101.dev.ttw/svn/webfleet/trunk/WF.Components/WF.components/codecoverage/src since the previous build
no change for https://ttbsvcs101.dev.ttw/svn/webfleet/trunk/WF.Components/WF.components/codecoverage/webapp since the previous build
no change for https://ttbsvcs101.dev.ttw/svn/webfleet/trunk/WF.Components/WF.components/session/SessionComponent.properties since the previous build
no change for https://ttbsvcs101.dev.ttw/svn/webfleet/trunk/WF.Components/WF.components/session/src since the previous build
no change for https://ttbsvcs101.dev.ttw/svn/webfleet/trunk/WF.Components/WF.components/session/test-src since the previous build
no change for https://ttbsvcs101.dev.ttw/svn/webfleet/trunk/WF.Components/WF.components/amfserialization/src since the previous build
no change for https://ttbsvcs101.dev.ttw/svn/webfleet/trunk/WF.Components/WF.components/httpJetty/src since the previous build
no change for https://ttbsvcs101.dev.ttw/svn/webfleet/trunk/WF.Components/WF.components/middleTierSupport/desc since the previous build
hudson.util.IOException2: revision check failed on https://ttbsvcs101.dev.ttw/svn/webfleet/trunk/WF.Components/WF.components/middleTierSupport/src
	at hudson.scm.SubversionChangeLogBuilder.buildModule(SubversionChangeLogBuilder.java:189)
	at hudson.scm.SubversionChangeLogBuilder.run(SubversionChangeLogBuilder.java:132)
	at hudson.scm.SubversionSCM.calcChangeLog(SubversionSCM.java:733)
	at hudson.scm.SubversionSCM.checkout(SubversionSCM.java:894)
	at hudson.model.AbstractProject.checkout(AbstractProject.java:1411)
	at hudson.model.AbstractBuild$AbstractBuildExecution.defaultCheckout(AbstractBuild.java:652)
	at jenkins.scm.SCMCheckoutStrategy.checkout(SCMCheckoutStrategy.java:88)
	at hudson.model.AbstractBuild$AbstractBuildExecution.run(AbstractBuild.java:557)
	at hudson.model.Run.execute(Run.java:1665)
	at hudson.model.FreeStyleBuild.run(FreeStyleBuild.java:46)
	at hudson.model.ResourceController.execute(ResourceController.java:88)
	at hudson.model.Executor.run(Executor.java:246)
Caused by: org.tmatesoft.svn.core.SVNException: svn: E175002: REPORT /svn/webfleet/!svn/bc/54800/trunk/WF.Components/WF.components/middleTierSupport/src failed
	at org.tmatesoft.svn.core.internal.io.dav.http.HTTPConnection.request(HTTPConnection.java:386)
	at org.tmatesoft.svn.core.internal.io.dav.http.HTTPConnection.request(HTTPConnection.java:373)
	at org.tmatesoft.svn.core.internal.io.dav.http.HTTPConnection.request(HTTPConnection.java:361)
	at org.tmatesoft.svn.core.internal.io.dav.DAVConnection.performHttpRequest(DAVConnection.java:707)
	at org.tmatesoft.svn.core.internal.io.dav.DAVConnection.doReport(DAVConnection.java:334)
	at org.tmatesoft.svn.core.internal.io.dav.DAVConnection.doReport(DAVConnection.java:324)
	at org.tmatesoft.svn.core.internal.io.dav.DAVRepository.logImpl(DAVRepository.java:995)
	at org.tmatesoft.svn.core.io.SVNRepository.log(SVNRepository.java:1035)
	at org.tmatesoft.svn.core.internal.wc2.remote.SvnRemoteLog.run(SvnRemoteLog.java:181)
	at org.tmatesoft.svn.core.internal.wc2.remote.SvnRemoteLog.run(SvnRemoteLog.java:35)
	at org.tmatesoft.svn.core.internal.wc2.SvnOperationRunner.run(SvnOperationRunner.java:20)
	at org.tmatesoft.svn.core.wc2.SvnOperationFactory.run(SvnOperationFactory.java:1238)
	at org.tmatesoft.svn.core.wc2.SvnOperation.run(SvnOperation.java:294)
	at org.tmatesoft.svn.core.wc.SVNLogClient.doLog(SVNLogClient.java:967)
	at org.tmatesoft.svn.core.wc.SVNLogClient.doLog(SVNLogClient.java:872)
	at hudson.scm.SubversionChangeLogBuilder.buildModule(SubversionChangeLogBuilder.java:177)
	... 11 more
Caused by: svn: E175002: REPORT /svn/webfleet/!svn/bc/54800/trunk/WF.Components/WF.components/middleTierSupport/src failed
	at org.tmatesoft.svn.core.SVNErrorMessage.create(SVNErrorMessage.java:208)
	at org.tmatesoft.svn.core.SVNErrorMessage.create(SVNErrorMessage.java:154)
	at org.tmatesoft.svn.core.SVNErrorMessage.create(SVNErrorMessage.java:97)
	... 27 more
Caused by: java.lang.StringIndexOutOfBoundsException: String index out of range: -1
	at java.lang.String.substring(String.java:1949)
	at java.lang.String.substring(String.java:1916)
	at hudson.scm.DirAwareSVNXMLLogHandler.handleLogEntry(DirAwareSVNXMLLogHandler.java:90)
	at org.tmatesoft.svn.core.internal.wc2.compat.SvnCodec$7.receive(SvnCodec.java:167)
	at org.tmatesoft.svn.core.internal.wc2.compat.SvnCodec$7.receive(SvnCodec.java:164)
	at org.tmatesoft.svn.core.wc2.SvnReceivingOperation.receive(SvnReceivingOperation.java:78)
	at org.tmatesoft.svn.core.internal.wc2.remote.SvnRemoteLog.handleLogEntry(SvnRemoteLog.java:199)
	at org.tmatesoft.svn.core.internal.io.dav.DAVRepository$1.handleLogEntry(DAVRepository.java:950)
	at org.tmatesoft.svn.core.internal.io.dav.handlers.DAVLogHandler.endElement(DAVLogHandler.java:226)
	at org.tmatesoft.svn.core.internal.io.dav.handlers.BasicDAVHandler.endElement(BasicDAVHandler.java:103)
	at com.sun.org.apache.xerces.internal.parsers.AbstractSAXParser.endElement(AbstractSAXParser.java:604)
	at com.sun.org.apache.xerces.internal.impl.XMLDocumentFragmentScannerImpl.scanEndElement(XMLDocumentFragmentScannerImpl.java:1759)
	at com.sun.org.apache.xerces.internal.impl.XMLDocumentFragmentScannerImpl$FragmentContentDriver.next(XMLDocumentFragmentScannerImpl.java:2915)
	at com.sun.org.apache.xerces.internal.impl.XMLDocumentScannerImpl.next(XMLDocumentScannerImpl.java:625)
	at com.sun.org.apache.xerces.internal.impl.XMLNSDocumentScannerImpl.next(XMLNSDocumentScannerImpl.java:116)
	at com.sun.org.apache.xerces.internal.impl.XMLDocumentFragmentScannerImpl.scanDocument(XMLDocumentFragmentScannerImpl.java:488)
	at com.sun.org.apache.xerces.internal.parsers.XML11Configuration.parse(XML11Configuration.java:819)
	at com.sun.org.apache.xerces.internal.parsers.XML11Configuration.parse(XML11Configuration.java:748)
	at com.sun.org.apache.xerces.internal.parsers.XMLParser.parse(XMLParser.java:123)
	at com.sun.org.apache.xerces.internal.parsers.AbstractSAXParser.parse(AbstractSAXParser.java:1208)
	at com.sun.org.apache.xerces.internal.jaxp.SAXParserImpl$JAXPSAXParser.parse(SAXParserImpl.java:525)
	at org.tmatesoft.svn.core.internal.io.dav.http.HTTPConnection.readData(HTTPConnection.java:911)
	at org.tmatesoft.svn.core.internal.io.dav.http.HTTPConnection.readData(HTTPConnection.java:876)
	at org.tmatesoft.svn.core.internal.io.dav.http.HTTPRequest.dispatch(HTTPRequest.java:220)
	at org.tmatesoft.svn.core.internal.io.dav.http.HTTPConnection._request(HTTPConnection.java:480)
	at org.tmatesoft.svn.core.internal.io.dav.http.HTTPConnection.request(HTTPConnection.java:382)
	... 26 more
Archiving artifacts
[ci-game] evaluating rule: Build result
[ci-game] scored: -10.0
[ci-game] evaluating rule: Increased number of failed tests
[ci-game] evaluating rule: Increased number of passed tests
[ci-game] evaluating rule: Decreased number of failed tests
[ci-game] evaluating rule: Decreased number of passed tests
Finished: FAILURE