2014-05-20 07:30:00.011 | Started by timer
2014-05-20 07:30:00.025 | Building in workspace /development/apps/config/jenkins/jobs/XPTO-analisys/workspace
2014-05-20 07:30:00.142 | Updating http://svntempo02.xpto.intranet/svn/Saude_Putilis/trunk/XPTO@HEAD at revision HEAD
2014-05-20 07:30:02.918 | U         ProjectDataService/src/main/resources/ibatis/mapping/movOperacional/detalheGuiaMedica.xml
2014-05-20 07:30:11.606 | At revision 13530
2014-05-20 07:30:12.174 | Parsing POMs
2014-05-20 07:30:12.815 | Downloaded artifact http://nexus.xpto.intranet/content/groups/proxies/br/com/xpto/ProjectParent/1.5.4-SNAPSHOT/maven-metadata.xml
2014-05-20 07:30:12.832 | Downloaded artifact http://nexus.xpto.intranet/content/groups/proxies/br/com/xpto/ProjectParent/1.5.4-SNAPSHOT/ProjectParent-1.5.4-20140520.025902-700.pom
2014-05-20 07:30:12.977 | [workspace] $ /usr/java/jdk1.7.0//bin/java -XX:MaxPermSize=256m -Xmx1500m -Dfile.encoding=UTF-8 -Dsun.jnu.enconding=UTF-8 -Djava.awt.headless=true -cp /development/apps/config/jenkins/plugins/maven-plugin/WEB-INF/lib/maven3-agent-1.5.jar:/development/tools/apache-maven-3.0.4/boot/plexus-classworlds-2.4.jar org.jvnet.hudson.maven3.agent.Maven3Main /development/tools/apache-maven-3.0.4 /development/apps/jenkins-tomcat-6.0.35/webapps/ROOT/WEB-INF/lib/remoting-2.41.jar /development/apps/config/jenkins/plugins/maven-plugin/WEB-INF/lib/maven3-interceptor-1.5.jar /development/apps/config/jenkins/plugins/maven-plugin/WEB-INF/lib/maven3-interceptor-commons-1.5.jar 37621
2014-05-20 07:30:14.136 | <===[JENKINS REMOTING CAPACITY]===>channel started
2014-05-20 07:30:16.889 | Executing Maven:  -B -f /development/apps/config/jenkins/jobs/XPTO-analisys/workspace/pom.xml -Dmaven.repo.local=/development/apps/config/jenkins/jobs/XPTO-analisys/workspace/.repository -U --update-snapshots -Dmaven.test.skip=true -DskipTests clean compile site checkstyle:checkstyle pmd:pmd findbugs:findbugs cobertura:cobertura
2014-05-20 07:30:18.260 | [INFO] Scanning for projects...
2014-05-20 07:30:18.799 | Downloading: http://nexus.xpto.intranet/content/groups/proxies/br/com/xpto/ProjectParent/1.5.4-SNAPSHOT/maven-metadata.xml
2014-05-20 07:30:20.514 | Downloaded: http://nexus.xpto.intranet/content/groups/proxies/br/com/xpto/ProjectParent/1.5.4-SNAPSHOT/maven-metadata.xml (618 B at 0.4 KB/sec)
2014-05-20 07:30:20.665 | [WARNING] 
2014-05-20 07:30:20.666 | [WARNING] Some problems were encountered while building the effective model for br.com.xpto:ProjectCommon:jar:1.5.4-SNAPSHOT
2014-05-20 07:30:20.666 | [WARNING] 'parent.relativePath' points at br.com.xpto:DummyProject instead of br.com.xpto:ProjectParent, please verify your project structure @ line 9, column 10
2014-05-20 07:30:20.666 | [WARNING] 
2014-05-20 07:30:20.666 | [WARNING] It is highly recommended to fix these problems because they threaten the stability of your build.
2014-05-20 07:30:20.666 | [WARNING] 
2014-05-20 07:30:20.667 | [WARNING] For this reason, future Maven versions might no longer support building such malformed projects.
2014-05-20 07:30:20.667 | [WARNING] 
2014-05-20 07:30:20.676 | [INFO] ------------------------------------------------------------------------
2014-05-20 07:30:20.676 | [INFO] Reactor Build Order:
2014-05-20 07:30:20.676 | [INFO] 
2014-05-20 07:30:20.676 | [INFO] ProjectParent
2014-05-20 07:30:20.676 | [INFO] ProjectCommon
2014-05-20 07:30:20.676 | [INFO] ProjectCoreService
2014-05-20 07:30:20.676 | [INFO] ProjectBusinessApi
2014-05-20 07:30:20.676 | [INFO] ProjectDataApi
2014-05-20 07:30:20.677 | [INFO] ProjectWebApi
2014-05-20 07:30:20.677 | [INFO] ProjectDataService
2014-05-20 07:30:20.677 | [INFO] ProjectBusinessService
2014-05-20 07:30:20.677 | [INFO] ProjectWebService
2014-05-20 07:30:20.677 | [INFO] ProjectDummy
2014-05-20 07:30:21.350 | Downloading: http://nexus.xpto.intranet/content/groups/proxies/org/apache/maven/plugins/maven-checkstyle-plugin/maven-metadata.xml
2014-05-20 07:30:21.501 | Downloaded: http://nexus.xpto.intranet/content/groups/proxies/org/apache/maven/plugins/maven-checkstyle-plugin/maven-metadata.xml (996 B at 6.4 KB/sec)
2014-05-20 07:30:21.551 | Downloading: http://nexus.xpto.intranet/content/groups/proxies/org/apache/maven/plugins/maven-pmd-plugin/maven-metadata.xml
2014-05-20 07:30:21.647 | Downloaded: http://nexus.xpto.intranet/content/groups/proxies/org/apache/maven/plugins/maven-pmd-plugin/maven-metadata.xml (965 B at 9.9 KB/sec)
2014-05-20 07:30:21.713 | Downloading: http://nexus.xpto.intranet/content/groups/proxies/org/codehaus/mojo/findbugs-maven-plugin/maven-metadata.xml
2014-05-20 07:30:21.793 | Downloaded: http://nexus.xpto.intranet/content/groups/proxies/org/codehaus/mojo/findbugs-maven-plugin/maven-metadata.xml (2 KB at 15.3 KB/sec)
2014-05-20 07:30:21.827 | Downloading: http://nexus.xpto.intranet/content/groups/proxies/org/codehaus/mojo/cobertura-maven-plugin/maven-metadata.xml
2014-05-20 07:30:21.892 | Downloaded: http://nexus.xpto.intranet/content/groups/proxies/org/codehaus/mojo/cobertura-maven-plugin/maven-metadata.xml (838 B at 12.6 KB/sec)
2014-05-20 07:30:21.961 | [INFO]                                                                         
2014-05-20 07:30:21.961 | [INFO] ------------------------------------------------------------------------
2014-05-20 07:30:21.961 | [INFO] Building ProjectParent 1.5.4-SNAPSHOT
2014-05-20 07:30:21.961 | [INFO] ------------------------------------------------------------------------
2014-05-20 07:30:22.153 | [INFO] 
2014-05-20 07:30:22.153 | [INFO] --- maven-clean-plugin:2.4.1:clean (default-clean) @ ProjectParent ---
2014-05-20 07:30:22.272 | [INFO] Deleting /development/apps/config/jenkins/jobs/XPTO-analisys/workspace/ProjectParent/target
2014-05-20 07:30:22.458 | [INFO] 
2014-05-20 07:30:22.458 | [INFO] --- maven-site-plugin:3.0:site (default-site) @ ProjectParent ---
2014-05-20 07:30:23.653 | [INFO] configuring report plugin org.apache.maven.plugins:maven-project-info-reports-plugin:2.5.1
2014-05-20 07:30:24.550 | [WARNING] No project URL defined - decoration links will not be relativized!
2014-05-20 07:30:24.551 | [INFO] Rendering site with org.apache.maven.skins:maven-default-skin:jar:1.0 skin.
2014-05-20 07:30:24.580 | [INFO] Generating "About" report    --- maven-project-info-reports-plugin:2.5.1
2014-05-20 07:30:24.958 | [INFO] Generating "Plugin Management" report    --- maven-project-info-reports-plugin:2.5.1
2014-05-20 07:30:25.241 | [INFO] Generating "Distribution Management" report    --- maven-project-info-reports-plugin:2.5.1
2014-05-20 07:30:25.345 | [INFO] Generating "Dependency Information" report    --- maven-project-info-reports-plugin:2.5.1
2014-05-20 07:30:25.460 | [INFO] Generating "Dependency Convergence" report    --- maven-project-info-reports-plugin:2.5.1
2014-05-20 07:30:25.626 | [INFO] Generating "Source Repository" report    --- maven-project-info-reports-plugin:2.5.1
2014-05-20 07:30:25.750 | [INFO] Generating "Mailing Lists" report    --- maven-project-info-reports-plugin:2.5.1
2014-05-20 07:30:25.822 | [INFO] Generating "Issue Tracking" report    --- maven-project-info-reports-plugin:2.5.1
2014-05-20 07:30:25.894 | [INFO] Generating "Continuous Integration" report    --- maven-project-info-reports-plugin:2.5.1
2014-05-20 07:30:25.965 | [INFO] Generating "Project Plugins" report    --- maven-project-info-reports-plugin:2.5.1
2014-05-20 07:30:26.071 | [INFO] Generating "Project License" report    --- maven-project-info-reports-plugin:2.5.1
2014-05-20 07:30:26.136 | [INFO] Generating "Dependency Management" report    --- maven-project-info-reports-plugin:2.5.1
2014-05-20 07:30:26.144 | [INFO] artifact br.com.xpto:ProjectCommon: checking for updates from nexus
2014-05-20 07:30:26.658 | [INFO] artifact br.com.xpto.security.audit:AuditTrail-AOP: checking for updates from nexus
2014-05-20 07:30:27.005 | Downloading: http://nexus.xpto.intranet/content/groups/proxies/br/com/xpto/security/audit/AuditTrail-AOP/1.0.0-SNAPSHOT/maven-metadata.xml
2014-05-20 07:30:27.030 | Downloaded: http://nexus.xpto.intranet/content/groups/proxies/br/com/xpto/security/audit/AuditTrail-AOP/1.0.0-SNAPSHOT/maven-metadata.xml (2 KB at 48.1 KB/sec)
2014-05-20 07:30:27.035 | Downloading: http://nexus.xpto.intranet/content/groups/proxies/br/com/xpto/security/audit/AuditTrail-Parent/1.0.0-SNAPSHOT/maven-metadata.xml
2014-05-20 07:30:27.053 | Downloaded: http://nexus.xpto.intranet/content/groups/proxies/br/com/xpto/security/audit/AuditTrail-Parent/1.0.0-SNAPSHOT/maven-metadata.xml (624 B at 33.9 KB/sec)
2014-05-20 07:30:27.061 | [INFO] artifact com.fasterxml.jackson.core:jackson-core: checking for updates from nexus
2014-05-20 07:30:27.174 | Downloading: http://nexus.xpto.intranet/content/groups/proxies/com/fasterxml/jackson/core/jackson-core/2.4.0-SNAPSHOT/maven-metadata.xml
2014-05-20 07:30:27.203 | Downloaded: http://nexus.xpto.intranet/content/groups/proxies/com/fasterxml/jackson/core/jackson-core/2.4.0-SNAPSHOT/maven-metadata.xml (1006 B at 33.9 KB/sec)
2014-05-20 07:30:27.243 | [INFO] artifact com.fasterxml.jackson.core:jackson-databind: checking for updates from nexus
2014-05-20 07:30:27.323 | Downloading: http://nexus.xpto.intranet/content/groups/proxies/com/fasterxml/jackson/core/jackson-databind/2.4.0-SNAPSHOT/maven-metadata.xml
2014-05-20 07:30:27.356 | Downloaded: http://nexus.xpto.intranet/content/groups/proxies/com/fasterxml/jackson/core/jackson-databind/2.4.0-SNAPSHOT/maven-metadata.xml (2 KB at 36.4 KB/sec)
2014-05-20 07:30:27.381 | [INFO] artifact com.fasterxml.jackson.jaxrs:jackson-jaxrs-json-provider: checking for updates from nexus
2014-05-20 07:30:27.485 | [INFO] artifact commons-codec:commons-codec: checking for updates from nexus
2014-05-20 07:30:27.555 | Downloading: http://nexus.xpto.intranet/content/groups/proxies/commons-codec/commons-codec/2.0-SNAPSHOT/maven-metadata.xml
2014-05-20 07:30:27.577 | Downloaded: http://nexus.xpto.intranet/content/groups/proxies/commons-codec/commons-codec/2.0-SNAPSHOT/maven-metadata.xml (3 KB at 109.6 KB/sec)
2014-05-20 07:30:27.599 | [INFO] artifact commons-collections:commons-collections: checking for updates from nexus
2014-05-20 07:30:27.691 | [INFO] artifact commons-httpclient:commons-httpclient: checking for updates from nexus
2014-05-20 07:30:27.931 | [INFO] artifact commons-lang:commons-lang: checking for updates from nexus
2014-05-20 07:30:28.022 | Downloading: http://nexus.xpto.intranet/content/groups/proxies/commons-lang/commons-lang/2.7-SNAPSHOT/maven-metadata.xml
2014-05-20 07:30:28.042 | Downloaded: http://nexus.xpto.intranet/content/groups/proxies/commons-lang/commons-lang/2.7-SNAPSHOT/maven-metadata.xml (2 KB at 99.1 KB/sec)
2014-05-20 07:30:28.063 | [INFO] artifact commons-validator:commons-validator: checking for updates from nexus
2014-05-20 07:30:28.137 | Downloading: http://nexus.xpto.intranet/content/groups/proxies/commons-validator/commons-validator/1.4.1-SNAPSHOT/maven-metadata.xml
2014-05-20 07:30:28.157 | Downloaded: http://nexus.xpto.intranet/content/groups/proxies/commons-validator/commons-validator/1.4.1-SNAPSHOT/maven-metadata.xml (2 KB at 80.6 KB/sec)
2014-05-20 07:30:28.186 | [INFO] artifact joda-time:joda-time: checking for updates from nexus
2014-05-20 07:30:28.264 | [INFO] artifact org.apache.logging.log4j:log4j-core: checking for updates from nexus
2014-05-20 07:30:28.370 | Downloading: http://nexus.xpto.intranet/content/groups/proxies/org/apache/logging/log4j/log4j-core/2.0RC999-SNAPSHOT/maven-metadata.xml
2014-05-20 07:30:28.403 | Downloaded: http://nexus.xpto.intranet/content/groups/proxies/org/apache/logging/log4j/log4j-core/2.0RC999-SNAPSHOT/maven-metadata.xml (1008 B at 29.8 KB/sec)
2014-05-20 07:30:28.418 | Downloading: http://nexus.xpto.intranet/content/groups/proxies/org/apache/logging/log4j/log4j/2.0RC999-SNAPSHOT/maven-metadata.xml
2014-05-20 07:30:28.440 | Downloaded: http://nexus.xpto.intranet/content/groups/proxies/org/apache/logging/log4j/log4j/2.0RC999-SNAPSHOT/maven-metadata.xml (612 B at 27.2 KB/sec)
2014-05-20 07:30:28.461 | [INFO] artifact org.apache.logging.log4j:log4j-slf4j-impl: checking for updates from nexus
2014-05-20 07:30:28.530 | Downloading: http://nexus.xpto.intranet/content/groups/proxies/org/apache/logging/log4j/log4j-slf4j-impl/2.0RC999-SNAPSHOT/maven-metadata.xml
2014-05-20 07:30:28.557 | Downloaded: http://nexus.xpto.intranet/content/groups/proxies/org/apache/logging/log4j/log4j-slf4j-impl/2.0RC999-SNAPSHOT/maven-metadata.xml (799 B at 28.9 KB/sec)
2014-05-20 07:30:28.585 | [INFO] artifact org.slf4j:slf4j-api: checking for updates from nexus
2014-05-20 07:30:28.717 | [INFO] artifact org.springframework:spring-web: checking for updates from nexus
2014-05-20 07:30:28.863 | Downloading: http://nexus.xpto.intranet/content/groups/proxies/org/springframework/spring-web/4.1.0.BUILD-SNAPSHOT/maven-metadata.xml
2014-05-20 07:30:28.900 | Downloaded: http://nexus.xpto.intranet/content/groups/proxies/org/springframework/spring-web/4.1.0.BUILD-SNAPSHOT/maven-metadata.xml (3 KB at 54.3 KB/sec)
2014-05-20 07:30:28.903 | Downloading: http://nexus.xpto.intranet/content/groups/proxies/org/springframework/spring-web/4.1.0.BUILD-SNAPSHOT/spring-web-4.1.0.BUILD-20140519.223932-149.pom
2014-05-20 07:30:28.924 | Downloaded: http://nexus.xpto.intranet/content/groups/proxies/org/springframework/spring-web/4.1.0.BUILD-SNAPSHOT/spring-web-4.1.0.BUILD-20140519.223932-149.pom (6 KB at 280.4 KB/sec)
2014-05-20 07:30:28.934 | [INFO] artifact org.springframework:spring-webmvc: checking for updates from nexus
2014-05-20 07:30:29.035 | Downloading: http://nexus.xpto.intranet/content/groups/proxies/org/springframework/spring-webmvc/4.1.0.BUILD-SNAPSHOT/maven-metadata.xml
2014-05-20 07:30:29.065 | Downloaded: http://nexus.xpto.intranet/content/groups/proxies/org/springframework/spring-webmvc/4.1.0.BUILD-SNAPSHOT/maven-metadata.xml (3 KB at 67.1 KB/sec)
2014-05-20 07:30:29.067 | Downloading: http://nexus.xpto.intranet/content/groups/proxies/org/springframework/spring-webmvc/4.1.0.BUILD-SNAPSHOT/spring-webmvc-4.1.0.BUILD-20140519.223932-149.pom
2014-05-20 07:30:29.088 | Downloaded: http://nexus.xpto.intranet/content/groups/proxies/org/springframework/spring-webmvc/4.1.0.BUILD-SNAPSHOT/spring-webmvc-4.1.0.BUILD-20140519.223932-149.pom (11 KB at 515.0 KB/sec)
2014-05-20 07:30:29.101 | [INFO] artifact junit:junit: checking for updates from nexus
2014-05-20 07:30:29.193 | Downloading: http://nexus.xpto.intranet/content/groups/proxies/junit/junit/4.12-SNAPSHOT/maven-metadata.xml
2014-05-20 07:30:29.211 | Downloaded: http://nexus.xpto.intranet/content/groups/proxies/junit/junit/4.12-SNAPSHOT/maven-metadata.xml (2 KB at 60.8 KB/sec)
2014-05-20 07:30:29.218 | [INFO] artifact org.springframework:spring-test: checking for updates from nexus
2014-05-20 07:30:29.321 | Downloading: http://nexus.xpto.intranet/content/groups/proxies/org/springframework/spring-test/4.1.0.BUILD-SNAPSHOT/maven-metadata.xml
2014-05-20 07:30:29.347 | Downloaded: http://nexus.xpto.intranet/content/groups/proxies/org/springframework/spring-test/4.1.0.BUILD-SNAPSHOT/maven-metadata.xml (3 KB at 77.4 KB/sec)
2014-05-20 07:30:29.349 | Downloading: http://nexus.xpto.intranet/content/groups/proxies/org/springframework/spring-test/4.1.0.BUILD-SNAPSHOT/spring-test-4.1.0.BUILD-20140519.223932-149.pom
2014-05-20 07:30:29.362 | Downloaded: http://nexus.xpto.intranet/content/groups/proxies/org/springframework/spring-test/4.1.0.BUILD-SNAPSHOT/spring-test-4.1.0.BUILD-20140519.223932-149.pom (7 KB at 505.0 KB/sec)
2014-05-20 07:30:29.374 | [INFO] artifact javax.servlet:servlet-api: checking for updates from nexus
2014-05-20 07:30:29.524 | [INFO] Generating "Project Team" report    --- maven-project-info-reports-plugin:2.5.1
2014-05-20 07:30:29.577 | [INFO] Generating "Project Summary" report    --- maven-project-info-reports-plugin:2.5.1
2014-05-20 07:30:29.629 | [INFO] Generating "Dependencies" report    --- maven-project-info-reports-plugin:2.5.1
2014-05-20 07:30:30.072 | [CHECKSTYLE] No report found for mojo site
2014-05-20 07:30:30.342 | [FINDBUGS] No report found for mojo site
2014-05-20 07:30:30.473 | [PMD] No report found for mojo site
2014-05-20 07:30:30.657 | [DRY] No report found for mojo site
2014-05-20 07:30:31.006 | [INFO] ------------------------------------------------------------------------
2014-05-20 07:30:31.007 | [INFO] Reactor Summary:
2014-05-20 07:30:31.007 | [INFO] 
2014-05-20 07:30:31.008 | [INFO] ProjectParent ............................... FAILURE [8.854s]
2014-05-20 07:30:31.008 | [INFO] ProjectCommon ............................... SKIPPED
2014-05-20 07:30:31.008 | [INFO] ProjectCoreService .......................... SKIPPED
2014-05-20 07:30:31.008 | [INFO] ProjectBusinessApi .......................... SKIPPED
2014-05-20 07:30:31.008 | [INFO] ProjectDataApi .............................. SKIPPED
2014-05-20 07:30:31.008 | [INFO] ProjectWebApi ............................... SKIPPED
2014-05-20 07:30:31.008 | [INFO] ProjectDataService .......................... SKIPPED
2014-05-20 07:30:31.008 | [INFO] ProjectBusinessService ...................... SKIPPED
2014-05-20 07:30:31.008 | [INFO] ProjectWebService ........................... SKIPPED
2014-05-20 07:30:31.008 | [INFO] ProjectDummy ................................ SKIPPED
2014-05-20 07:30:31.008 | [INFO] ------------------------------------------------------------------------
2014-05-20 07:30:31.008 | [INFO] BUILD FAILURE
2014-05-20 07:30:31.008 | [INFO] ------------------------------------------------------------------------
2014-05-20 07:30:31.009 | [INFO] Total time: 12.801s
2014-05-20 07:30:31.009 | [INFO] Finished at: Tue May 20 07:30:31 BRT 2014
2014-05-20 07:30:31.147 | [INFO] Final Memory: 25M/296M
2014-05-20 07:30:31.147 | [INFO] ------------------------------------------------------------------------
2014-05-20 07:30:31.245 | Waiting for Jenkins to finish collecting data
2014-05-20 07:30:31.250 | [ERROR] Internal error: java.lang.NullPointerException -> [Help 1]
2014-05-20 07:30:31.250 | org.apache.maven.InternalErrorException: Internal error: java.lang.NullPointerException
2014-05-20 07:30:31.250 | 	at org.apache.maven.lifecycle.internal.BuilderCommon.handleBuildError(BuilderCommon.java:128)
2014-05-20 07:30:31.250 | [JENKINS] Archiving /development/apps/config/jenkins/jobs/XPTO-analisys/workspace/ProjectCommon/pom.xml to br.com.xpto/ProjectCommon/1.5.4-SNAPSHOT/ProjectCommon-1.5.4-SNAPSHOT.pom
2014-05-20 07:30:31.250 | 	at org.apache.maven.lifecycle.internal.LifecycleModuleBuilder.buildProject(LifecycleModuleBuilder.java:95)
2014-05-20 07:30:31.250 | 	at org.apache.maven.lifecycle.internal.LifecycleModuleBuilder.buildProject(LifecycleModuleBuilder.java:59)
2014-05-20 07:30:31.250 | 	at org.apache.maven.lifecycle.internal.LifecycleStarter.singleThreadedBuild(LifecycleStarter.java:183)
2014-05-20 07:30:31.250 | 	at org.apache.maven.lifecycle.internal.LifecycleStarter.execute(LifecycleStarter.java:161)
2014-05-20 07:30:31.250 | 	at org.apache.maven.DefaultMaven.doExecute(DefaultMaven.java:320)
2014-05-20 07:30:31.250 | 	at org.apache.maven.DefaultMaven.execute(DefaultMaven.java:156)
2014-05-20 07:30:31.250 | 	at org.jvnet.hudson.maven3.launcher.Maven3Launcher.main(Maven3Launcher.java:117)
2014-05-20 07:30:31.250 | 	at sun.reflect.NativeMethodAccessorImpl.invoke0(Native Method)
2014-05-20 07:30:31.250 | 	at sun.reflect.NativeMethodAccessorImpl.invoke(NativeMethodAccessorImpl.java:57)
2014-05-20 07:30:31.250 | 	at sun.reflect.DelegatingMethodAccessorImpl.invoke(DelegatingMethodAccessorImpl.java:43)
2014-05-20 07:30:31.250 | 	at java.lang.reflect.Method.invoke(Method.java:601)
2014-05-20 07:30:31.250 | 	at org.codehaus.plexus.classworlds.launcher.Launcher.launchStandard(Launcher.java:329)
2014-05-20 07:30:31.250 | 	at org.codehaus.plexus.classworlds.launcher.Launcher.launch(Launcher.java:239)
2014-05-20 07:30:31.250 | 	at org.jvnet.hudson.maven3.agent.Maven3Main.launch(Maven3Main.java:178)
2014-05-20 07:30:31.250 | 	at sun.reflect.NativeMethodAccessorImpl.invoke0(Native Method)
2014-05-20 07:30:31.250 | 	at sun.reflect.NativeMethodAccessorImpl.invoke(NativeMethodAccessorImpl.java:57)
2014-05-20 07:30:31.250 | 	at sun.reflect.DelegatingMethodAccessorImpl.invoke(DelegatingMethodAccessorImpl.java:43)
2014-05-20 07:30:31.250 | 	at java.lang.reflect.Method.invoke(Method.java:601)
2014-05-20 07:30:31.250 | 	at hudson.maven.Maven3Builder.call(Maven3Builder.java:134)
2014-05-20 07:30:31.250 | 	at hudson.maven.Maven3Builder.call(Maven3Builder.java:69)
2014-05-20 07:30:31.250 | 	at hudson.remoting.UserRequest.perform(UserRequest.java:118)
2014-05-20 07:30:31.250 | 	at hudson.remoting.UserRequest.perform(UserRequest.java:48)
2014-05-20 07:30:31.250 | 	at hudson.remoting.Request$2.run(Request.java:328)
2014-05-20 07:30:31.250 | 	at hudson.remoting.InterceptingExecutorService$1.call(InterceptingExecutorService.java:72)
2014-05-20 07:30:31.250 | 	at java.util.concurrent.FutureTask$Sync.innerRun(FutureTask.java:334)
2014-05-20 07:30:31.250 | 	at java.util.concurrent.FutureTask.run(FutureTask.java:166)
2014-05-20 07:30:31.250 | 	at java.util.concurrent.ThreadPoolExecutor.runWorker(ThreadPoolExecutor.java:1110)
2014-05-20 07:30:31.250 | 	at java.util.concurrent.ThreadPoolExecutor$Worker.run(ThreadPoolExecutor.java:603)
2014-05-20 07:30:31.250 | 	at java.lang.Thread.run(Thread.java:722)
2014-05-20 07:30:31.250 | Caused by: java.lang.NullPointerException
2014-05-20 07:30:31.250 | 	at hudson.maven.reporters.MavenSiteArchiver.getModulePath(MavenSiteArchiver.java:126)
2014-05-20 07:30:31.250 | 	at hudson.maven.reporters.MavenSiteArchiver.postExecute(MavenSiteArchiver.java:82)
2014-05-20 07:30:31.250 | 	at hudson.maven.Maven3Builder$MavenExecutionListener.recordMojoEnded(Maven3Builder.java:628)
2014-05-20 07:30:31.250 | 	at hudson.maven.Maven3Builder$MavenExecutionListener.mojoSucceeded(Maven3Builder.java:610)
2014-05-20 07:30:31.251 | 	at org.apache.maven.lifecycle.internal.DefaultExecutionEventCatapult.fire(DefaultExecutionEventCatapult.java:87)
2014-05-20 07:30:31.251 | 	at org.apache.maven.lifecycle.internal.DefaultExecutionEventCatapult.fire(DefaultExecutionEventCatapult.java:42)
2014-05-20 07:30:31.251 | 	at org.apache.maven.lifecycle.internal.MojoExecutor.execute(MojoExecutor.java:228)
2014-05-20 07:30:31.251 | 	at org.apache.maven.lifecycle.internal.MojoExecutor.execute(MojoExecutor.java:153)
2014-05-20 07:30:31.251 | 	at org.apache.maven.lifecycle.internal.MojoExecutor.execute(MojoExecutor.java:145)
2014-05-20 07:30:31.251 | 	at org.apache.maven.lifecycle.internal.LifecycleModuleBuilder.buildProject(LifecycleModuleBuilder.java:84)
2014-05-20 07:30:31.251 | 	... 28 more
2014-05-20 07:30:31.251 | [JENKINS] Archiving /development/apps/config/jenkins/jobs/XPTO-analisys/workspace/ProjectParent/pom.xml to br.com.xpto/ProjectParent/1.5.4-SNAPSHOT/ProjectParent-1.5.4-SNAPSHOT.pom
2014-05-20 07:30:31.251 | [ERROR] 
2014-05-20 07:30:31.251 | [ERROR] To see the full stack trace of the errors, re-run Maven with the -e switch.
2014-05-20 07:30:31.251 | [ERROR] Re-run Maven using the -X switch to enable full debug logging.
2014-05-20 07:30:31.251 | [ERROR] 
2014-05-20 07:30:31.252 | [ERROR] For more information about the errors and possible solutions, please read the following articles:
2014-05-20 07:30:31.252 | [ERROR] [Help 1] http://cwiki.apache.org/confluence/display/MAVEN/InternalErrorException
2014-05-20 07:30:31.264 | [JENKINS] Archiving /development/apps/config/jenkins/jobs/XPTO-analisys/workspace/ProjectWebService/pom.xml to br.com.xpto/ProjectWebService/1.5.4-SNAPSHOT/ProjectWebService-1.5.4-SNAPSHOT.pom
2014-05-20 07:30:31.265 | [JENKINS] Archiving /development/apps/config/jenkins/jobs/XPTO-analisys/workspace/ProjectDataService/pom.xml to br.com.xpto/ProjectDataService/1.5.4-SNAPSHOT/ProjectDataService-1.5.4-SNAPSHOT.pom
2014-05-20 07:30:31.266 | [JENKINS] Archiving /development/apps/config/jenkins/jobs/XPTO-analisys/workspace/pom.xml to br.com.xpto/DummyProject/1.5.4-SNAPSHOT/DummyProject-1.5.4-SNAPSHOT.pom
2014-05-20 07:30:31.266 | [JENKINS] Archiving /development/apps/config/jenkins/jobs/XPTO-analisys/workspace/ProjectBusinessService/pom.xml to br.com.xpto/ProjectBusinessService/1.5.4-SNAPSHOT/ProjectBusinessService-1.5.4-SNAPSHOT.pom
2014-05-20 07:30:31.267 | [JENKINS] Archiving /development/apps/config/jenkins/jobs/XPTO-analisys/workspace/ProjectCoreService/pom.xml to br.com.xpto/ProjectCoreService/1.5.4-SNAPSHOT/ProjectCoreService-1.5.4-SNAPSHOT.pom
2014-05-20 07:30:31.268 | [JENKINS] Archiving /development/apps/config/jenkins/jobs/XPTO-analisys/workspace/ProjectDataApi/pom.xml to br.com.xpto/ProjectDataApi/1.5.4-SNAPSHOT/ProjectDataApi-1.5.4-SNAPSHOT.pom
2014-05-20 07:30:31.268 | [JENKINS] Archiving /development/apps/config/jenkins/jobs/XPTO-analisys/workspace/ProjectBusinessApi/pom.xml to br.com.xpto/ProjectBusinessApi/1.5.4-SNAPSHOT/ProjectBusinessApi-1.5.4-SNAPSHOT.pom
2014-05-20 07:30:31.269 | [JENKINS] Archiving /development/apps/config/jenkins/jobs/XPTO-analisys/workspace/ProjectWebApi/pom.xml to br.com.xpto/ProjectWebApi/1.5.4-SNAPSHOT/ProjectWebApi-1.5.4-SNAPSHOT.pom
2014-05-20 07:30:35.115 | channel stopped
2014-05-20 07:30:35.300 | [ANALYSIS-COLLECTOR] Computing warning deltas based on reference build #250
2014-05-20 07:30:35.300 | [ANALYSIS-COLLECTOR] Plug-in Result: Success - no threshold has been exceeded
2014-05-20 07:30:35.313 | Sending e-mails to: GROUP-ALIAS@xpto.com.br
2014-05-20 07:30:36.365 | Finished: FAILURE