Uploaded image for project: 'Jenkins'
  1. Jenkins
  2. JENKINS-14495

Exception: java.lang.RuntimeException: Failed to instantiate class hudson.plugins.parameterizedtrigger.TriggerBuilder

    XMLWordPrintable

    Details

    • Type: Bug
    • Status: Resolved (View Workflow)
    • Priority: Major
    • Resolution: Fixed
    • Labels:
      None
    • Environment:
      CentOS 6 x86_64, jre-1.7.0_04-fcs.x86_64, Jenkins 1.474, Parameterized trigger plugin 2.15
    • Similar Issues:

      Description

      Whenever I add a build step "trigger/call builds on other projects" and click save, I get the following error:

      Status Code: 500

      Exception: java.lang.RuntimeException: Failed to instantiate class hudson.plugins.parameterizedtrigger.TriggerBuilder from {"configs":

      {"block":true,"buildStepFailureThreshold":"FAILURE","failureThreshold":"FAILURE","projects":"SlaveJob1","unstableThreshold":"UNSTABLE"}

      ,"kind":"hudson.plugins.parameterizedtrigger.TriggerBuilder","stapler-class":"hudson.plugins.parameterizedtrigger.TriggerBuilder"}
      Stacktrace:
      javax.servlet.ServletException: java.lang.RuntimeException: Failed to instantiate class hudson.plugins.parameterizedtrigger.TriggerBuilder from {"configs":

      {"block":true,"buildStepFailureThreshold":"FAILURE","failureThreshold":"FAILURE","projects":"SlaveJob1","unstableThreshold":"UNSTABLE"}

      ,"kind":"hudson.plugins.parameterizedtrigger.TriggerBuilder","stapler-class":"hudson.plugins.parameterizedtrigger.TriggerBuilder"}
      at org.kohsuke.stapler.Stapler.tryInvoke(Stapler.java:616)
      at org.kohsuke.stapler.Stapler.invoke(Stapler.java:659)
      at org.kohsuke.stapler.MetaClass$6.doDispatch(MetaClass.java:241)
      at org.kohsuke.stapler.NameBasedDispatcher.dispatch(NameBasedDispatcher.java:53)
      at org.kohsuke.stapler.Stapler.tryInvoke(Stapler.java:574)
      at org.kohsuke.stapler.Stapler.invoke(Stapler.java:659)
      at org.kohsuke.stapler.MetaClass$6.doDispatch(MetaClass.java:241)
      at org.kohsuke.stapler.NameBasedDispatcher.dispatch(NameBasedDispatcher.java:53)
      at org.kohsuke.stapler.Stapler.tryInvoke(Stapler.java:574)
      at org.kohsuke.stapler.Stapler.invoke(Stapler.java:659)
      at org.kohsuke.stapler.Stapler.invoke(Stapler.java:488)
      at org.kohsuke.stapler.Stapler.service(Stapler.java:162)
      at javax.servlet.http.HttpServlet.service(HttpServlet.java:45)
      at winstone.ServletConfiguration.execute(ServletConfiguration.java:248)
      at winstone.RequestDispatcher.forward(RequestDispatcher.java:333)
      at winstone.RequestDispatcher.doFilter(RequestDispatcher.java:376)
      at hudson.util.PluginServletFilter$1.doFilter(PluginServletFilter.java:95)
      at hudson.util.PluginServletFilter.doFilter(PluginServletFilter.java:87)
      at winstone.FilterConfiguration.execute(FilterConfiguration.java:194)
      at winstone.RequestDispatcher.doFilter(RequestDispatcher.java:366)
      at hudson.security.csrf.CrumbFilter.doFilter(CrumbFilter.java:47)
      at winstone.FilterConfiguration.execute(FilterConfiguration.java:194)
      at winstone.RequestDispatcher.doFilter(RequestDispatcher.java:366)
      at hudson.security.ChainedServletFilter$1.doFilter(ChainedServletFilter.java:84)
      at hudson.security.UnwrapSecurityExceptionFilter.doFilter(UnwrapSecurityExceptionFilter.java:51)
      at hudson.security.ChainedServletFilter$1.doFilter(ChainedServletFilter.java:87)
      at org.acegisecurity.ui.ExceptionTranslationFilter.doFilter(ExceptionTranslationFilter.java:166)
      at hudson.security.ChainedServletFilter$1.doFilter(ChainedServletFilter.java:87)
      at org.acegisecurity.providers.anonymous.AnonymousProcessingFilter.doFilter(AnonymousProcessingFilter.java:125)
      at hudson.security.ChainedServletFilter$1.doFilter(ChainedServletFilter.java:87)
      at org.acegisecurity.ui.rememberme.RememberMeProcessingFilter.doFilter(RememberMeProcessingFilter.java:142)
      at hudson.security.ChainedServletFilter$1.doFilter(ChainedServletFilter.java:87)
      at org.acegisecurity.ui.AbstractProcessingFilter.doFilter(AbstractProcessingFilter.java:271)
      at hudson.security.ChainedServletFilter$1.doFilter(ChainedServletFilter.java:87)
      at org.acegisecurity.ui.basicauth.BasicProcessingFilter.doFilter(BasicProcessingFilter.java:173)
      at hudson.security.ChainedServletFilter$1.doFilter(ChainedServletFilter.java:87)
      at jenkins.security.ApiTokenFilter.doFilter(ApiTokenFilter.java:63)
      at hudson.security.ChainedServletFilter$1.doFilter(ChainedServletFilter.java:87)
      at org.acegisecurity.context.HttpSessionContextIntegrationFilter.doFilter(HttpSessionContextIntegrationFilter.java:249)
      at hudson.security.HttpSessionContextIntegrationFilter2.doFilter(HttpSessionContextIntegrationFilter2.java:66)
      at hudson.security.ChainedServletFilter$1.doFilter(ChainedServletFilter.java:87)
      at hudson.security.ChainedServletFilter.doFilter(ChainedServletFilter.java:76)
      at hudson.security.HudsonFilter.doFilter(HudsonFilter.java:164)
      at winstone.FilterConfiguration.execute(FilterConfiguration.java:194)
      at winstone.RequestDispatcher.doFilter(RequestDispatcher.java:366)
      at org.kohsuke.stapler.compression.CompressionFilter.doFilter(CompressionFilter.java:50)
      at winstone.FilterConfiguration.execute(FilterConfiguration.java:194)
      at winstone.RequestDispatcher.doFilter(RequestDispatcher.java:366)
      at hudson.util.CharacterEncodingFilter.doFilter(CharacterEncodingFilter.java:81)
      at winstone.FilterConfiguration.execute(FilterConfiguration.java:194)
      at winstone.RequestDispatcher.doFilter(RequestDispatcher.java:366)
      at winstone.RequestDispatcher.forward(RequestDispatcher.java:331)
      at winstone.RequestHandlerThread.processRequest(RequestHandlerThread.java:215)
      at winstone.RequestHandlerThread.run(RequestHandlerThread.java:138)
      at java.util.concurrent.Executors$RunnableAdapter.call(Unknown Source)
      at java.util.concurrent.FutureTask$Sync.innerRun(Unknown Source)
      at java.util.concurrent.FutureTask.run(Unknown Source)
      at winstone.BoundedExecutorService$1.run(BoundedExecutorService.java:77)
      at java.util.concurrent.ThreadPoolExecutor.runWorker(Unknown Source)
      at java.util.concurrent.ThreadPoolExecutor$Worker.run(Unknown Source)
      at java.lang.Thread.run(Unknown Source)
      Caused by: java.lang.RuntimeException: Failed to instantiate class hudson.plugins.parameterizedtrigger.TriggerBuilder from {"configs":

      {"block":true,"buildStepFailureThreshold":"FAILURE","failureThreshold":"FAILURE","projects":"SlaveJob1","unstableThreshold":"UNSTABLE"}

      ,"kind":"hudson.plugins.parameterizedtrigger.TriggerBuilder","stapler-class":"hudson.plugins.parameterizedtrigger.TriggerBuilder"}
      at hudson.model.Descriptor.newInstance(Descriptor.java:575)
      at hudson.model.Descriptor.newInstancesFromHeteroList(Descriptor.java:912)
      at hudson.model.Descriptor.newInstancesFromHeteroList(Descriptor.java:899)
      at hudson.util.DescribableList.rebuildHetero(DescribableList.java:203)
      at hudson.model.Project.submit(Project.java:202)
      at hudson.model.Job.doConfigSubmit(Job.java:990)
      at hudson.model.AbstractProject.doConfigSubmit(AbstractProject.java:688)
      at sun.reflect.NativeMethodAccessorImpl.invoke0(Native Method)
      at sun.reflect.NativeMethodAccessorImpl.invoke(Unknown Source)
      at sun.reflect.DelegatingMethodAccessorImpl.invoke(Unknown Source)
      at java.lang.reflect.Method.invoke(Unknown Source)
      at org.kohsuke.stapler.Function$InstanceFunction.invoke(Function.java:288)
      at org.kohsuke.stapler.Function.bindAndInvoke(Function.java:151)
      at org.kohsuke.stapler.Function.bindAndInvokeAndServeResponse(Function.java:90)
      at org.kohsuke.stapler.MetaClass$1.doDispatch(MetaClass.java:111)
      at org.kohsuke.stapler.NameBasedDispatcher.dispatch(NameBasedDispatcher.java:53)
      at org.kohsuke.stapler.Stapler.tryInvoke(Stapler.java:574)
      ... 60 more
      Caused by: java.lang.IllegalArgumentException: Failed to instantiate class hudson.plugins.parameterizedtrigger.TriggerBuilder from {"configs":

      {"block":true,"buildStepFailureThreshold":"FAILURE","failureThreshold":"FAILURE","projects":"SlaveJob1","unstableThreshold":"UNSTABLE"}

      ,"kind":"hudson.plugins.parameterizedtrigger.TriggerBuilder","stapler-class":"hudson.plugins.parameterizedtrigger.TriggerBuilder"}
      at org.kohsuke.stapler.RequestImpl$TypePair.convertJSON(RequestImpl.java:633)
      at org.kohsuke.stapler.RequestImpl.bindJSON(RequestImpl.java:377)
      at org.kohsuke.stapler.RequestImpl.bindJSON(RequestImpl.java:373)
      at hudson.model.Descriptor.newInstance(Descriptor.java:566)
      ... 76 more
      Caused by: java.lang.IllegalArgumentException: Failed to convert the configs parameter of the constructor public hudson.plugins.parameterizedtrigger.TriggerBuilder(java.util.List)
      at org.kohsuke.stapler.RequestImpl$TypePair.convertJSON(RequestImpl.java:627)
      ... 79 more
      Caused by: java.lang.IllegalArgumentException: Failed to instantiate class hudson.plugins.parameterizedtrigger.BlockableBuildTriggerConfig from

      {"block":true,"buildStepFailureThreshold":"FAILURE","failureThreshold":"FAILURE","projects":"SlaveJob1","unstableThreshold":"UNSTABLE"}

      at org.kohsuke.stapler.RequestImpl$TypePair.convertJSON(RequestImpl.java:633)
      at org.kohsuke.stapler.RequestImpl$TypePair.convertJSON(RequestImpl.java:669)
      at org.kohsuke.stapler.RequestImpl.bindJSON(RequestImpl.java:377)
      at org.kohsuke.stapler.RequestImpl$TypePair.convertJSON(RequestImpl.java:625)
      ... 79 more
      Caused by: java.lang.IllegalArgumentException: Failed to convert the block parameter of the constructor public hudson.plugins.parameterizedtrigger.BlockableBuildTriggerConfig(java.lang.String,hudson.plugins.parameterizedtrigger.BlockingBehaviour,java.util.List,java.util.List)
      at org.kohsuke.stapler.RequestImpl$TypePair.convertJSON(RequestImpl.java:627)
      ... 82 more
      Caused by: java.lang.IllegalArgumentException: Unable to convert to class hudson.plugins.parameterizedtrigger.BlockingBehaviour
      at org.kohsuke.stapler.RequestImpl$TypePair.convertJSON(RequestImpl.java:688)
      at org.kohsuke.stapler.RequestImpl.bindJSON(RequestImpl.java:377)
      at org.kohsuke.stapler.RequestImpl$TypePair.convertJSON(RequestImpl.java:625)
      ... 82 more

        Attachments

          Issue Links

            Activity

            Hide
            dogfood dogfood added a comment -

            Integrated in jenkins_main_trunk #1871
            JENKINS-14495 Noting further changes. (Revision 9c016d61a0b5972f1c84b7137a0bce031ac80c17)

            Result = UNSTABLE
            Jesse Glick : 9c016d61a0b5972f1c84b7137a0bce031ac80c17
            Files :

            • changelog.html
            Show
            dogfood dogfood added a comment - Integrated in jenkins_main_trunk #1871 JENKINS-14495 Noting further changes. (Revision 9c016d61a0b5972f1c84b7137a0bce031ac80c17) Result = UNSTABLE Jesse Glick : 9c016d61a0b5972f1c84b7137a0bce031ac80c17 Files : changelog.html
            Hide
            scm_issue_link SCM/JIRA link daemon added a comment -

            Code changed in jenkins
            User: Jesse Glick
            Path:
            changelog.html
            core/src/main/resources/hudson/PluginManager/_table.js
            core/src/main/resources/hudson/console/ExpandableDetailsNote/script.js
            core/src/main/resources/hudson/matrix/LabelAxis/config.jelly
            core/src/main/resources/hudson/security/GlobalMatrixAuthorizationStrategy/config.jelly
            core/src/main/resources/lib/form/advanced/advanced.js
            core/src/main/resources/lib/form/apply/apply.js
            core/src/main/resources/lib/form/combobox/combobox.js
            core/src/main/resources/lib/form/hetero-list/hetero-list.js
            core/src/main/resources/lib/form/radioBlock/radioBlock.js
            core/src/main/resources/lib/form/repeatable/repeatable.js
            core/src/main/resources/lib/form/select/select.js
            core/src/main/resources/lib/form/textarea/textarea.js
            core/src/main/resources/lib/hudson/projectViewNested.js
            core/src/main/resources/lib/layout/breadcrumbs.js
            core/src/main/resources/lib/layout/copyButton/copyButton.js
            test/src/test/java/scripts/BehaviorTest.java
            test/src/test/resources/lib/layout/RenderOnDemandTest/testBehaviour.jelly
            test/src/test/resources/scripts/BehaviorTest/testDuplicateRegistrations.jelly
            test/src/test/resources/scripts/BehaviorTest/testSelectorOrdering.jelly
            ui-samples-plugin/src/main/resources/jenkins/plugins/ui_samples/SyntaxHighlightedTextArea/index.groovy
            war/src/main/webapp/scripts/behavior.js
            war/src/main/webapp/scripts/hudson-behavior.js
            http://jenkins-ci.org/commit/jenkins/3b1c38675357706d982c804971193f5a2df8eff4
            Log:
            Merge pull request #545 from jglick/Behaviour-specify-14495

            JENKINS-14495 Define Behaviour.specify.

            Compare: https://github.com/jenkinsci/jenkins/compare/c733b24be79d...3b1c38675357

            Show
            scm_issue_link SCM/JIRA link daemon added a comment - Code changed in jenkins User: Jesse Glick Path: changelog.html core/src/main/resources/hudson/PluginManager/_table.js core/src/main/resources/hudson/console/ExpandableDetailsNote/script.js core/src/main/resources/hudson/matrix/LabelAxis/config.jelly core/src/main/resources/hudson/security/GlobalMatrixAuthorizationStrategy/config.jelly core/src/main/resources/lib/form/advanced/advanced.js core/src/main/resources/lib/form/apply/apply.js core/src/main/resources/lib/form/combobox/combobox.js core/src/main/resources/lib/form/hetero-list/hetero-list.js core/src/main/resources/lib/form/radioBlock/radioBlock.js core/src/main/resources/lib/form/repeatable/repeatable.js core/src/main/resources/lib/form/select/select.js core/src/main/resources/lib/form/textarea/textarea.js core/src/main/resources/lib/hudson/projectViewNested.js core/src/main/resources/lib/layout/breadcrumbs.js core/src/main/resources/lib/layout/copyButton/copyButton.js test/src/test/java/scripts/BehaviorTest.java test/src/test/resources/lib/layout/RenderOnDemandTest/testBehaviour.jelly test/src/test/resources/scripts/BehaviorTest/testDuplicateRegistrations.jelly test/src/test/resources/scripts/BehaviorTest/testSelectorOrdering.jelly ui-samples-plugin/src/main/resources/jenkins/plugins/ui_samples/SyntaxHighlightedTextArea/index.groovy war/src/main/webapp/scripts/behavior.js war/src/main/webapp/scripts/hudson-behavior.js http://jenkins-ci.org/commit/jenkins/3b1c38675357706d982c804971193f5a2df8eff4 Log: Merge pull request #545 from jglick/Behaviour-specify-14495 JENKINS-14495 Define Behaviour.specify. Compare: https://github.com/jenkinsci/jenkins/compare/c733b24be79d...3b1c38675357
            Hide
            scm_issue_link SCM/JIRA link daemon added a comment -

            Code changed in jenkins
            User: Jesse Glick
            Path:
            changelog.html
            http://jenkins-ci.org/commit/jenkins/9c016d61a0b5972f1c84b7137a0bce031ac80c17
            Log:
            JENKINS-14495 Noting further changes.

            Show
            scm_issue_link SCM/JIRA link daemon added a comment - Code changed in jenkins User: Jesse Glick Path: changelog.html http://jenkins-ci.org/commit/jenkins/9c016d61a0b5972f1c84b7137a0bce031ac80c17 Log: JENKINS-14495 Noting further changes.
            Hide
            dogfood dogfood added a comment -

            Integrated in jenkins_main_trunk #1835
            JENKINS-14495 Refined fix - needed to pull uniqueness check out of apply() fn in case we were being passed an Array of nodes. (Revision f39fbdb312c3c87ef77a72446273423d906942ed)

            Result = SUCCESS
            Jesse Glick : f39fbdb312c3c87ef77a72446273423d906942ed
            Files :

            • test/src/test/resources/scripts/BehaviorTest/testDuplicateRegistrations.jelly
            • test/src/test/java/scripts/BehaviorTest.java
            • war/src/main/webapp/scripts/behavior.js
            Show
            dogfood dogfood added a comment - Integrated in jenkins_main_trunk #1835 JENKINS-14495 Refined fix - needed to pull uniqueness check out of apply() fn in case we were being passed an Array of nodes. (Revision f39fbdb312c3c87ef77a72446273423d906942ed) Result = SUCCESS Jesse Glick : f39fbdb312c3c87ef77a72446273423d906942ed Files : test/src/test/resources/scripts/BehaviorTest/testDuplicateRegistrations.jelly test/src/test/java/scripts/BehaviorTest.java war/src/main/webapp/scripts/behavior.js
            Hide
            scm_issue_link SCM/JIRA link daemon added a comment -

            Code changed in jenkins
            User: Jesse Glick
            Path:
            test/src/test/java/scripts/BehaviorTest.java
            test/src/test/resources/scripts/BehaviorTest/testDuplicateRegistrations.jelly
            war/src/main/webapp/scripts/behavior.js
            http://jenkins-ci.org/commit/jenkins/f39fbdb312c3c87ef77a72446273423d906942ed
            Log:
            JENKINS-14495 Refined fix - needed to pull uniqueness check out of apply() fn in case we were being passed an Array of nodes.
            Fixes test failures introduced by dbb100d, and adds a test for it now that I know it can be done.

            Show
            scm_issue_link SCM/JIRA link daemon added a comment - Code changed in jenkins User: Jesse Glick Path: test/src/test/java/scripts/BehaviorTest.java test/src/test/resources/scripts/BehaviorTest/testDuplicateRegistrations.jelly war/src/main/webapp/scripts/behavior.js http://jenkins-ci.org/commit/jenkins/f39fbdb312c3c87ef77a72446273423d906942ed Log: JENKINS-14495 Refined fix - needed to pull uniqueness check out of apply() fn in case we were being passed an Array of nodes. Fixes test failures introduced by dbb100d, and adds a test for it now that I know it can be done.

              People

              Assignee:
              jglick Jesse Glick
              Reporter:
              romu Romu Hu
              Votes:
              4 Vote for this issue
              Watchers:
              17 Start watching this issue

                Dates

                Created:
                Updated:
                Resolved: