Uploaded image for project: 'Jenkins'
  1. Jenkins
  2. JENKINS-55405

org.apache.commons.jelly.JellyTagException:

    XMLWordPrintable

    Details

    • Type: Bug
    • Status: Fixed but Unreleased (View Workflow)
    • Priority: Blocker
    • Resolution: Duplicate
    • Component/s: testlink-plugin
    • Labels:
    • Environment:
      Jenkins ver. 2.150.1
      WIN 10
      Testlink plugin 3.15
      c
    • Similar Issues:

      Description

      Error  when i try to get a TESTLINK information

       

      org.apache.commons.jelly.JellyTagException: jar:file:/C:/Program%20Files%20(x86)/Jenkins/plugins/testlink/WEB-INF/lib/testlink.jar!/hudson/plugins/testlink/TestLinkResult/index.jelly:6:57: <st:include> No page

        Attachments

          Issue Links

            Activity

            miguel_angelo Miguel Angelo created issue -
            moazzamnaim Moazzam Naim made changes -
            Field Original Value New Value
            Attachment Jenkins-JellyTagException.txt [ 46613 ]
            Hide
            moazzamnaim Moazzam Naim added a comment - - edited

            I am also getting below Exception when tried to access Failed Tests from the Test Results Analyzer report. I can successfully access the Passed Tests from this report. Exception error occurs only when tried to access Failed Tests. Please see the attached file for the full dump of Exception message. My Jenkins version is 2.121.1 and have Test Results Analyzer plugin installed along with TestNg and Extent Reports plugins.

            org.apache.commons.jelly.JellyTagException: jar:file:/C:/Jenkins/war/WEB-INF/lib/jenkins-core-2.121.1.jar!/lib/layout/layout.jelly:267:25: <d:invokeBody> org.apache.commons.jelly.JellyTagException: jar:file:/C:/Jenkins/war/WEB-INF/lib/jenkins-core-2.121.1.jar!/lib/layout/main-panel.jelly:36:21: <d:invokeBody> org.apache.commons.jelly.JellyTagException: Cannot get property 'escapeExceptionMsg' on null object

            Show
            moazzamnaim Moazzam Naim added a comment - - edited I am also getting below Exception when tried to access Failed Tests from the Test Results Analyzer report. I can successfully access the Passed Tests from this report. Exception error occurs only when tried to access Failed Tests. Please see the attached file for the full dump of Exception message. My Jenkins version is 2.121.1 and have Test Results Analyzer plugin installed along with TestNg and Extent Reports plugins. org.apache.commons.jelly.JellyTagException: jar: file:/C:/Jenkins/war/WEB-INF/lib/jenkins-core-2.121.1.jar!/lib/layout/layout.jelly:267:25: <d:invokeBody> org.apache.commons.jelly.JellyTagException: jar: file:/C:/Jenkins/war/WEB-INF/lib/jenkins-core-2.121.1.jar!/lib/layout/main-panel.jelly:36:21: <d:invokeBody> org.apache.commons.jelly.JellyTagException: Cannot get property 'escapeExceptionMsg' on null object
            moazzamnaim Moazzam Naim made changes -
            Environment Jenkins ver. 2.150.1
            WIN 10
            Testlink plugin 3.15
            Jenkins ver. 2.150.1
            WIN 10
            Testlink plugin 3.15
            c
            Hide
            kinow Bruno P. Kinoshita added a comment -

            I ended up updating JENKINS-64023, which is duplicated of this, sorry. Closing and will keep sending updates to JENKINS-64023.

            Show
            kinow Bruno P. Kinoshita added a comment - I ended up updating JENKINS-64023 , which is duplicated of this, sorry. Closing and will keep sending updates to JENKINS-64023 .
            kinow Bruno P. Kinoshita made changes -
            Link This issue is duplicated by JENKINS-64023 [ JENKINS-64023 ]
            kinow Bruno P. Kinoshita made changes -
            Resolution Duplicate [ 3 ]
            Status Open [ 1 ] Fixed but Unreleased [ 10203 ]

              People

              Assignee:
              kinow Bruno P. Kinoshita
              Reporter:
              miguel_angelo Miguel Angelo
              Votes:
              1 Vote for this issue
              Watchers:
              3 Start watching this issue

                Dates

                Created:
                Updated:
                Resolved: