Uploaded image for project: 'Jenkins'
  1. Jenkins
  2. JENKINS-37423

Connection refused when trying to release

    XMLWordPrintable

    Details

    • Similar Issues:

      Description

      [WARNING] Could not transfer metadata org.jenkins-ci.plugins:crossbrowsertesting:0.17-SNAPSHOT/maven-metadata.xml from/to maven.jenkins-ci.org (http://maven.jenkins-ci.org:8081/content/repositories/snapshots): Connect to maven.jenkins-ci.org:8081 [maven.jenkins-ci.org/199.193.196.24] failed: Connection refused
      [INFO] ------------------------------------------------------------------------
      [INFO] BUILD FAILURE
      [INFO] ------------------------------------------------------------------------
      [INFO] Total time: 30.725 s
      [INFO] Finished at: 2016-08-15T15:22:09-05:00
      [INFO] Final Memory: 35M/574M
      [INFO] ------------------------------------------------------------------------
      [ERROR] Failed to execute goal org.apache.maven.plugins:maven-deploy-plugin:2.6:deploy (default-deploy) on project crossbrowsertesting: Failed to retrieve remote metadata org.jenkins-ci.plugins:crossbrowsertesting:0.17-SNAPSHOT/maven-metadata.xml: Could not transfer metadata org.jenkins-ci.plugins:crossbrowsertesting:0.17-SNAPSHOT/maven-metadata.xml from/to maven.jenkins-ci.org (http://maven.jenkins-ci.org:8081/content/repositories/snapshots): Connect to maven.jenkins-ci.org:8081 [maven.jenkins-ci.org/199.193.196.24] failed: Connection refused -> [Help 1]
      [ERROR]
      [ERROR] To see the full stack trace of the errors, re-run Maven with the -e switch.
      [ERROR] Re-run Maven using the -X switch to enable full debug logging.
      [ERROR]
      [ERROR] For more information about the errors and possible solutions, please read the following articles:
      [ERROR] [Help 1] http://cwiki.apache.org/confluence/display/MAVEN/MojoExecutionException

        Attachments

          Activity

          Hide
          crossbrowsertesting CrossBrowserTesting.com LLC added a comment -

          trying to release a hot fix ASAP

          Show
          crossbrowsertesting CrossBrowserTesting.com LLC added a comment - trying to release a hot fix ASAP
          Hide
          lonkaryogeshr Yogesh Lonkar added a comment -

          Having same issue when trying to release job-fan-in plugin. but environment is Windows 7

          Show
          lonkaryogeshr Yogesh Lonkar added a comment - Having same issue when trying to release job-fan-in plugin. but environment is Windows 7
          Hide
          crossbrowsertesting CrossBrowserTesting.com LLC added a comment -

          fixed it. had to update the parent to version of at least 2.5 in pom.xml
          https://wiki.jenkins-ci.org/display/JENKINS/Hosting+Plugins#HostingPlugins-Workingaroundcommonissues

          Show
          crossbrowsertesting CrossBrowserTesting.com LLC added a comment - fixed it. had to update the parent to version of at least 2.5 in pom.xml https://wiki.jenkins-ci.org/display/JENKINS/Hosting+Plugins#HostingPlugins-Workingaroundcommonissues

            People

            Assignee:
            crossbrowsertesting CrossBrowserTesting.com LLC
            Reporter:
            crossbrowsertesting CrossBrowserTesting.com LLC
            Votes:
            1 Vote for this issue
            Watchers:
            2 Start watching this issue

              Dates

              Created:
              Updated:
              Resolved: