Uploaded image for project: 'Jenkins'
  1. Jenkins
  2. JENKINS-48636

Plugin does not build due to failing dependency

    XMLWordPrintable

    Details

    • Similar Issues:

      Description

      With the commit e7ccc924186b77a8d27970d789cba0f9f90fb35a the azure-commons plugin will fail to build with:

      [INFO] Installing /data/azure-commons-core/target/azure-commons-core-sources.jar to /root/.m2/repository/org/jenkins-ci/plugins/azure-commons-core/0.1.0-SNAPSHOT/azure-commons-core-0.1.0-SNAPSHOT-sources.jar
      [INFO] 
      [INFO] ------------------------------------------------------------------------
      [INFO] Building Azure Commons Plugin 0.2.0-SNAPSHOT
      [INFO] ------------------------------------------------------------------------
      [INFO] Downloading from repo.jenkins-ci.org: https://repo.jenkins-ci.org/public/com/microsoft/jenkins/azure-commons-core/0.1.0-SNAPSHOT/maven-metadata.xml
      [INFO] Downloading from repo.jenkins-ci.org: https://repo.jenkins-ci.org/public/com/microsoft/jenkins/azure-commons-core/0.1.0-SNAPSHOT/azure-commons-core-0.1.0-SNAPSHOT.pom
      [WARNING] The POM for com.microsoft.jenkins:azure-commons-core:jar:0.1.0-SNAPSHOT is missing, no dependency information available
      [INFO] Downloading from repo.jenkins-ci.org: https://repo.jenkins-ci.org/public/com/microsoft/jenkins/azure-commons-core/0.1.0-SNAPSHOT/azure-commons-core-0.1.0-SNAPSHOT.jar
      [INFO] ------------------------------------------------------------------------
      [INFO] Reactor Summary:
      [INFO] 
      [INFO] Azure Commons Pom .................................. SUCCESS [ 16.835 s]
      [INFO] Azure Commons Cores Libraries ...................... SUCCESS [ 12.943 s]
      [INFO] Azure Commons Plugin ............................... FAILURE [  7.475 s]
      [INFO] ------------------------------------------------------------------------
      [INFO] BUILD FAILURE
      [INFO] ------------------------------------------------------------------------
      [INFO] Total time: 38.806 s
      [INFO] Finished at: 2017-12-19T17:02:15Z
      [INFO] Final Memory: 235M/1748M
      [INFO] ------------------------------------------------------------------------
      [ERROR] Failed to execute goal on project azure-commons: Could not resolve dependencies for project org.jenkins-ci.plugins:azure-commons:hpi:0.2.0-SNAPSHOT: Could not find artifact com.microsoft.jenkins:azure-commons-core:jar:0.1.0-SNAPSHOT in repo.jenkins-ci.org (https://repo.jenkins-ci.org/public/) -> [Help 1]
      org.apache.maven.lifecycle.LifecycleExecutionException: Failed to execute goal on project azure-commons: Could not resolve dependencies for project org.jenkins-ci.plugins:azure-commons:hpi:0.2.0-SNAPSHOT: Could not find artifact com.microsoft.jenkins:azure-commons-core:jar:0.1.0-SNAPSHOT in repo.jenkins-ci.org (https://repo.jenkins-ci.org/public/)
          at org.apache.maven.lifecycle.internal.LifecycleDependencyResolver.getDependencies (LifecycleDependencyResolver.java:249)
          at org.apache.maven.lifecycle.internal.LifecycleDependencyResolver.resolveProjectDependencies (LifecycleDependencyResolver.java:145)
          at org.apache.maven.lifecycle.internal.MojoExecutor.ensureDependenciesAreResolved (MojoExecutor.java:246)
          at org.apache.maven.lifecycle.internal.MojoExecutor.execute (MojoExecutor.java:200)
          at org.apache.maven.lifecycle.internal.MojoExecutor.execute (MojoExecutor.java:154)
          at org.apache.maven.lifecycle.internal.MojoExecutor.execute (MojoExecutor.java:146)
          at org.apache.maven.lifecycle.internal.LifecycleModuleBuilder.buildProject (LifecycleModuleBuilder.java:117)
          at org.apache.maven.lifecycle.internal.LifecycleModuleBuilder.buildProject (LifecycleModuleBuilder.java:81)
          at org.apache.maven.lifecycle.internal.builder.singlethreaded.SingleThreadedBuilder.build (SingleThreadedBuilder.java:51)
          at org.apache.maven.lifecycle.internal.LifecycleStarter.execute (LifecycleStarter.java:128)
          at org.apache.maven.DefaultMaven.doExecute (DefaultMaven.java:309)
          at org.apache.maven.DefaultMaven.doExecute (DefaultMaven.java:194)
          at org.apache.maven.DefaultMaven.execute (DefaultMaven.java:107)
          at org.apache.maven.cli.MavenCli.execute (MavenCli.java:955)
          at org.apache.maven.cli.MavenCli.doMain (MavenCli.java:290)
          at org.apache.maven.cli.MavenCli.main (MavenCli.java:194)
          at sun.reflect.NativeMethodAccessorImpl.invoke0 (Native Method)
          at sun.reflect.NativeMethodAccessorImpl.invoke (NativeMethodAccessorImpl.java:62)
          at sun.reflect.DelegatingMethodAccessorImpl.invoke (DelegatingMethodAccessorImpl.java:43)
          at java.lang.reflect.Method.invoke (Method.java:498)
          at org.codehaus.plexus.classworlds.launcher.Launcher.launchEnhanced (Launcher.java:289)
          at org.codehaus.plexus.classworlds.launcher.Launcher.launch (Launcher.java:229)
          at org.codehaus.plexus.classworlds.launcher.Launcher.mainWithExitCode (Launcher.java:415)
          at org.codehaus.plexus.classworlds.launcher.Launcher.main (Launcher.java:356)
      Caused by: org.apache.maven.project.DependencyResolutionException: Could not resolve dependencies for project org.jenkins-ci.plugins:azure-commons:hpi:0.2.0-SNAPSHOT: Could not find artifact com.microsoft.jenkins:azure-commons-core:jar:0.1.0-SNAPSHOT in repo.jenkins-ci.org (https://repo.jenkins-ci.org/public/)
          at org.apache.maven.project.DefaultProjectDependenciesResolver.resolve (DefaultProjectDependenciesResolver.java:209)
          at org.apache.maven.lifecycle.internal.LifecycleDependencyResolver.getDependencies (LifecycleDependencyResolver.java:223)
          at org.apache.maven.lifecycle.internal.LifecycleDependencyResolver.resolveProjectDependencies (LifecycleDependencyResolver.java:145)
          at org.apache.maven.lifecycle.internal.MojoExecutor.ensureDependenciesAreResolved (MojoExecutor.java:246)
          at org.apache.maven.lifecycle.internal.MojoExecutor.execute (MojoExecutor.java:200)
          at org.apache.maven.lifecycle.internal.MojoExecutor.execute (MojoExecutor.java:154)
          at org.apache.maven.lifecycle.internal.MojoExecutor.execute (MojoExecutor.java:146)
          at org.apache.maven.lifecycle.internal.LifecycleModuleBuilder.buildProject (LifecycleModuleBuilder.java:117)
          at org.apache.maven.lifecycle.internal.LifecycleModuleBuilder.buildProject (LifecycleModuleBuilder.java:81)
          at org.apache.maven.lifecycle.internal.builder.singlethreaded.SingleThreadedBuilder.build (SingleThreadedBuilder.java:51)
          at org.apache.maven.lifecycle.internal.LifecycleStarter.execute (LifecycleStarter.java:128)
          at org.apache.maven.DefaultMaven.doExecute (DefaultMaven.java:309)
          at org.apache.maven.DefaultMaven.doExecute (DefaultMaven.java:194)
          at org.apache.maven.DefaultMaven.execute (DefaultMaven.java:107)
          at org.apache.maven.cli.MavenCli.execute (MavenCli.java:955)
          at org.apache.maven.cli.MavenCli.doMain (MavenCli.java:290)
          at org.apache.maven.cli.MavenCli.main (MavenCli.java:194)
          at sun.reflect.NativeMethodAccessorImpl.invoke0 (Native Method)
          at sun.reflect.NativeMethodAccessorImpl.invoke (NativeMethodAccessorImpl.java:62)
          at sun.reflect.DelegatingMethodAccessorImpl.invoke (DelegatingMethodAccessorImpl.java:43)
          at java.lang.reflect.Method.invoke (Method.java:498)
          at org.codehaus.plexus.classworlds.launcher.Launcher.launchEnhanced (Launcher.java:289)
          at org.codehaus.plexus.classworlds.launcher.Launcher.launch (Launcher.java:229)
          at org.codehaus.plexus.classworlds.launcher.Launcher.mainWithExitCode (Launcher.java:415)
          at org.codehaus.plexus.classworlds.launcher.Launcher.main (Launcher.java:356)
      Caused by: org.eclipse.aether.resolution.DependencyResolutionException: Could not find artifact com.microsoft.jenkins:azure-commons-core:jar:0.1.0-SNAPSHOT in repo.jenkins-ci.org (https://repo.jenkins-ci.org/public/)
          at org.eclipse.aether.internal.impl.DefaultRepositorySystem.resolveDependencies (DefaultRepositorySystem.java:355)
          at org.apache.maven.project.DefaultProjectDependenciesResolver.resolve (DefaultProjectDependenciesResolver.java:202)
          at org.apache.maven.lifecycle.internal.LifecycleDependencyResolver.getDependencies (LifecycleDependencyResolver.java:223)
          at org.apache.maven.lifecycle.internal.LifecycleDependencyResolver.resolveProjectDependencies (LifecycleDependencyResolver.java:145)
          at org.apache.maven.lifecycle.internal.MojoExecutor.ensureDependenciesAreResolved (MojoExecutor.java:246)
          at org.apache.maven.lifecycle.internal.MojoExecutor.execute (MojoExecutor.java:200)
          at org.apache.maven.lifecycle.internal.MojoExecutor.execute (MojoExecutor.java:154)
          at org.apache.maven.lifecycle.internal.MojoExecutor.execute (MojoExecutor.java:146)
          at org.apache.maven.lifecycle.internal.LifecycleModuleBuilder.buildProject (LifecycleModuleBuilder.java:117)
          at org.apache.maven.lifecycle.internal.LifecycleModuleBuilder.buildProject (LifecycleModuleBuilder.java:81)
          at org.apache.maven.lifecycle.internal.builder.singlethreaded.SingleThreadedBuilder.build (SingleThreadedBuilder.java:51)
          at org.apache.maven.lifecycle.internal.LifecycleStarter.execute (LifecycleStarter.java:128)
          at org.apache.maven.DefaultMaven.doExecute (DefaultMaven.java:309)
          at org.apache.maven.DefaultMaven.doExecute (DefaultMaven.java:194)
          at org.apache.maven.DefaultMaven.execute (DefaultMaven.java:107)
          at org.apache.maven.cli.MavenCli.execute (MavenCli.java:955)
          at org.apache.maven.cli.MavenCli.doMain (MavenCli.java:290)
          at org.apache.maven.cli.MavenCli.main (MavenCli.java:194)
          at sun.reflect.NativeMethodAccessorImpl.invoke0 (Native Method)
          at sun.reflect.NativeMethodAccessorImpl.invoke (NativeMethodAccessorImpl.java:62)
          at sun.reflect.DelegatingMethodAccessorImpl.invoke (DelegatingMethodAccessorImpl.java:43)
          at java.lang.reflect.Method.invoke (Method.java:498)
          at org.codehaus.plexus.classworlds.launcher.Launcher.launchEnhanced (Launcher.java:289)
          at org.codehaus.plexus.classworlds.launcher.Launcher.launch (Launcher.java:229)
          at org.codehaus.plexus.classworlds.launcher.Launcher.mainWithExitCode (Launcher.java:415)
          at org.codehaus.plexus.classworlds.launcher.Launcher.main (Launcher.java:356)
      Caused by: org.eclipse.aether.resolution.ArtifactResolutionException: Could not find artifact com.microsoft.jenkins:azure-commons-core:jar:0.1.0-SNAPSHOT in repo.jenkins-ci.org (https://repo.jenkins-ci.org/public/)
          at org.eclipse.aether.internal.impl.DefaultArtifactResolver.resolve (DefaultArtifactResolver.java:422)
          at org.eclipse.aether.internal.impl.DefaultArtifactResolver.resolveArtifacts (DefaultArtifactResolver.java:224)
          at org.eclipse.aether.internal.impl.DefaultRepositorySystem.resolveDependencies (DefaultRepositorySystem.java:338)
          at org.apache.maven.project.DefaultProjectDependenciesResolver.resolve (DefaultProjectDependenciesResolver.java:202)
          at org.apache.maven.lifecycle.internal.LifecycleDependencyResolver.getDependencies (LifecycleDependencyResolver.java:223)
          at org.apache.maven.lifecycle.internal.LifecycleDependencyResolver.resolveProjectDependencies (LifecycleDependencyResolver.java:145)
          at org.apache.maven.lifecycle.internal.MojoExecutor.ensureDependenciesAreResolved (MojoExecutor.java:246)
          at org.apache.maven.lifecycle.internal.MojoExecutor.execute (MojoExecutor.java:200)
          at org.apache.maven.lifecycle.internal.MojoExecutor.execute (MojoExecutor.java:154)
          at org.apache.maven.lifecycle.internal.MojoExecutor.execute (MojoExecutor.java:146)
          at org.apache.maven.lifecycle.internal.LifecycleModuleBuilder.buildProject (LifecycleModuleBuilder.java:117)
          at org.apache.maven.lifecycle.internal.LifecycleModuleBuilder.buildProject (LifecycleModuleBuilder.java:81)
          at org.apache.maven.lifecycle.internal.builder.singlethreaded.SingleThreadedBuilder.build (SingleThreadedBuilder.java:51)
          at org.apache.maven.lifecycle.internal.LifecycleStarter.execute (LifecycleStarter.java:128)
          at org.apache.maven.DefaultMaven.doExecute (DefaultMaven.java:309)
          at org.apache.maven.DefaultMaven.doExecute (DefaultMaven.java:194)
          at org.apache.maven.DefaultMaven.execute (DefaultMaven.java:107)
          at org.apache.maven.cli.MavenCli.execute (MavenCli.java:955)
          at org.apache.maven.cli.MavenCli.doMain (MavenCli.java:290)
          at org.apache.maven.cli.MavenCli.main (MavenCli.java:194)
          at sun.reflect.NativeMethodAccessorImpl.invoke0 (Native Method)
          at sun.reflect.NativeMethodAccessorImpl.invoke (NativeMethodAccessorImpl.java:62)
          at sun.reflect.DelegatingMethodAccessorImpl.invoke (DelegatingMethodAccessorImpl.java:43)
          at java.lang.reflect.Method.invoke (Method.java:498)
          at org.codehaus.plexus.classworlds.launcher.Launcher.launchEnhanced (Launcher.java:289)
          at org.codehaus.plexus.classworlds.launcher.Launcher.launch (Launcher.java:229)
          at org.codehaus.plexus.classworlds.launcher.Launcher.mainWithExitCode (Launcher.java:415)
          at org.codehaus.plexus.classworlds.launcher.Launcher.main (Launcher.java:356)
      Caused by: org.eclipse.aether.transfer.ArtifactNotFoundException: Could not find artifact com.microsoft.jenkins:azure-commons-core:jar:0.1.0-SNAPSHOT in repo.jenkins-ci.org (https://repo.jenkins-ci.org/public/)
          at org.eclipse.aether.connector.basic.ArtifactTransportListener.transferFailed (ArtifactTransportListener.java:48)
          at org.eclipse.aether.connector.basic.BasicRepositoryConnector$TaskRunner.run (BasicRepositoryConnector.java:365)
          at org.eclipse.aether.util.concurrency.RunnableErrorForwarder$1.run (RunnableErrorForwarder.java:75)
          at org.eclipse.aether.connector.basic.BasicRepositoryConnector$DirectExecutor.execute (BasicRepositoryConnector.java:583)
          at org.eclipse.aether.connector.basic.BasicRepositoryConnector.get (BasicRepositoryConnector.java:259)
          at org.eclipse.aether.internal.impl.DefaultArtifactResolver.performDownloads (DefaultArtifactResolver.java:498)
          at org.eclipse.aether.internal.impl.DefaultArtifactResolver.resolve (DefaultArtifactResolver.java:399)
          at org.eclipse.aether.internal.impl.DefaultArtifactResolver.resolveArtifacts (DefaultArtifactResolver.java:224)
          at org.eclipse.aether.internal.impl.DefaultRepositorySystem.resolveDependencies (DefaultRepositorySystem.java:338)
          at org.apache.maven.project.DefaultProjectDependenciesResolver.resolve (DefaultProjectDependenciesResolver.java:202)
          at org.apache.maven.lifecycle.internal.LifecycleDependencyResolver.getDependencies (LifecycleDependencyResolver.java:223)
          at org.apache.maven.lifecycle.internal.LifecycleDependencyResolver.resolveProjectDependencies (LifecycleDependencyResolver.java:145)
          at org.apache.maven.lifecycle.internal.MojoExecutor.ensureDependenciesAreResolved (MojoExecutor.java:246)
          at org.apache.maven.lifecycle.internal.MojoExecutor.execute (MojoExecutor.java:200)
          at org.apache.maven.lifecycle.internal.MojoExecutor.execute (MojoExecutor.java:154)
          at org.apache.maven.lifecycle.internal.MojoExecutor.execute (MojoExecutor.java:146)
          at org.apache.maven.lifecycle.internal.LifecycleModuleBuilder.buildProject (LifecycleModuleBuilder.java:117)
          at org.apache.maven.lifecycle.internal.LifecycleModuleBuilder.buildProject (LifecycleModuleBuilder.java:81)
          at org.apache.maven.lifecycle.internal.builder.singlethreaded.SingleThreadedBuilder.build (SingleThreadedBuilder.java:51)
          at org.apache.maven.lifecycle.internal.LifecycleStarter.execute (LifecycleStarter.java:128)
          at org.apache.maven.DefaultMaven.doExecute (DefaultMaven.java:309)
          at org.apache.maven.DefaultMaven.doExecute (DefaultMaven.java:194)
          at org.apache.maven.DefaultMaven.execute (DefaultMaven.java:107)
          at org.apache.maven.cli.MavenCli.execute (MavenCli.java:955)
          at org.apache.maven.cli.MavenCli.doMain (MavenCli.java:290)
          at org.apache.maven.cli.MavenCli.main (MavenCli.java:194)
          at sun.reflect.NativeMethodAccessorImpl.invoke0 (Native Method)
          at sun.reflect.NativeMethodAccessorImpl.invoke (NativeMethodAccessorImpl.java:62)
          at sun.reflect.DelegatingMethodAccessorImpl.invoke (DelegatingMethodAccessorImpl.java:43)
          at java.lang.reflect.Method.invoke (Method.java:498)
          at org.codehaus.plexus.classworlds.launcher.Launcher.launchEnhanced (Launcher.java:289)
          at org.codehaus.plexus.classworlds.launcher.Launcher.launch (Launcher.java:229)
          at org.codehaus.plexus.classworlds.launcher.Launcher.mainWithExitCode (Launcher.java:415)
          at org.codehaus.plexus.classworlds.launcher.Launcher.main (Launcher.java:356)
      [ERROR] 
      [ERROR] Re-run Maven using the -X switch to enable full debug logging.
      [ERROR] 
      [ERROR] For more information about the errors and possible solutions, please read the following articles:
      [ERROR] [Help 1] http://cwiki.apache.org/confluence/display/MAVEN/DependencyResolutionException
      [ERROR] 
      [ERROR] After correcting the problems, you can resume the build with the command
      [ERROR]   mvn <goals> -rf :azure-commons
      
      

        Attachments

          Issue Links

            Activity

            Hide
            rtyler R. Tyler Croy added a comment -

            A git bisect shows that this commit is the bad one:

            commit a6ecfd08f14e809cd7146bf211f7ef6b707a11dd
            Author: Raphael Yu <xianyu@Microsoft.com>
            Date:   Tue Dec 19 11:45:52 2017 +0800
            
                Fix the group Id.
            
            :040000 040000 5606a2431f878b38fdbfdad55907f156e18e61ff 328e8bf325bc1c785bea7d3b749921d980572151 M	azure-commons-core
            :040000 040000 af993bb4d2bec1c177c36e19409193d314b22bdb ebd816ad7bc6f78be51a3dab30d0583251d24b4c M	azure-commons-plugin
            :100644 100644 c040620634665cd1d69e038ba1ed66802979ee47 95e5cc71502b48491368b4fae0e3ddb8f21cfd36 M	pom.xml
            
            Show
            rtyler R. Tyler Croy added a comment - A git bisect shows that this commit is the bad one: commit a6ecfd08f14e809cd7146bf211f7ef6b707a11dd Author: Raphael Yu <xianyu@Microsoft.com> Date: Tue Dec 19 11:45:52 2017 +0800 Fix the group Id. :040000 040000 5606a2431f878b38fdbfdad55907f156e18e61ff 328e8bf325bc1c785bea7d3b749921d980572151 M azure-commons-core :040000 040000 af993bb4d2bec1c177c36e19409193d314b22bdb ebd816ad7bc6f78be51a3dab30d0583251d24b4c M azure-commons-plugin :100644 100644 c040620634665cd1d69e038ba1ed66802979ee47 95e5cc71502b48491368b4fae0e3ddb8f21cfd36 M pom.xml
            Hide
            scm_issue_link SCM/JIRA link daemon added a comment -

            Code changed in jenkins
            User: R. Tyler Croy
            Path:
            Jenkinsfile
            http://jenkins-ci.org/commit/azure-commons-plugin/6a4fde6cb62142628ec075a081de0c0abadb36cc
            Log:
            Introduce a Jenkinsfile for CI of this plugin

            This should help prevent failures like JENKINS-48636 from being merged in the future

            Show
            scm_issue_link SCM/JIRA link daemon added a comment - Code changed in jenkins User: R. Tyler Croy Path: Jenkinsfile http://jenkins-ci.org/commit/azure-commons-plugin/6a4fde6cb62142628ec075a081de0c0abadb36cc Log: Introduce a Jenkinsfile for CI of this plugin This should help prevent failures like JENKINS-48636 from being merged in the future
            Hide
            rtyler R. Tyler Croy added a comment -

            Added a Jenkinsfile via a Pull Request which should also demonstrate the failure.

            Show
            rtyler R. Tyler Croy added a comment - Added a Jenkinsfile via a Pull Request which should also demonstrate the failure.
            Hide
            abayer Andrew Bayer added a comment -

            A better PR is up at https://github.com/jenkinsci/azure-commons-plugin/pull/15. It fixes the versioning and groupId stuff across the project.

            Show
            abayer Andrew Bayer added a comment - A better PR is up at https://github.com/jenkinsci/azure-commons-plugin/pull/15 . It fixes the versioning and groupId stuff across the project.
            Hide
            scm_issue_link SCM/JIRA link daemon added a comment -

            Code changed in jenkins
            User: Andrew Bayer
            Path:
            azure-commons-core/pom.xml
            azure-commons-plugin/pom.xml
            pom.xml
            http://jenkins-ci.org/commit/azure-commons-plugin/0c1a677e5f18b2d2c1e0f4b5e21e51ba37ad6224
            Log:
            [FIXED JENKINS-48636] Fix versioning and groupId.

            Show
            scm_issue_link SCM/JIRA link daemon added a comment - Code changed in jenkins User: Andrew Bayer Path: azure-commons-core/pom.xml azure-commons-plugin/pom.xml pom.xml http://jenkins-ci.org/commit/azure-commons-plugin/0c1a677e5f18b2d2c1e0f4b5e21e51ba37ad6224 Log: [FIXED JENKINS-48636] Fix versioning and groupId.
            Hide
            scm_issue_link SCM/JIRA link daemon added a comment -

            Code changed in jenkins
            User: Raphael Yu
            Path:
            azure-commons-core/pom.xml
            azure-commons-plugin/pom.xml
            pom.xml
            http://jenkins-ci.org/commit/azure-commons-plugin/efa14aec6c047bb4fd44c01f377381497eab7790
            Log:
            Merge pull request #15 from abayer/jenkins-48636

            [FIXED JENKINS-48636] Fix versioning and groupId.

            Compare: https://github.com/jenkinsci/azure-commons-plugin/compare/a98229b34294...efa14aec6c04

            Show
            scm_issue_link SCM/JIRA link daemon added a comment - Code changed in jenkins User: Raphael Yu Path: azure-commons-core/pom.xml azure-commons-plugin/pom.xml pom.xml http://jenkins-ci.org/commit/azure-commons-plugin/efa14aec6c047bb4fd44c01f377381497eab7790 Log: Merge pull request #15 from abayer/jenkins-48636 [FIXED JENKINS-48636] Fix versioning and groupId. Compare: https://github.com/jenkinsci/azure-commons-plugin/compare/a98229b34294...efa14aec6c04

              People

              Assignee:
              azure_devops Azure DevOps
              Reporter:
              rtyler R. Tyler Croy
              Votes:
              0 Vote for this issue
              Watchers:
              3 Start watching this issue

                Dates

                Created:
                Updated:
                Resolved: